Thread: Hello

Results 1 to 2 of 2
  1. #1
    xXNoobAlertXx's Avatar
    Join Date
    May 2010
    Gender
    male
    Posts
    125
    Reputation
    9
    Thanks
    76

    Hello

    I am in need of some assistance on a hack these are the errors i am getting and i do not know why...

    1>------ Build started: Project: King4940's PUB v1.0, Configuration: Debug Win32 ------
    1>Build started 6/16/2010 11:29:55 PM.
    1>InitializeBuildStatus:
    1> Touching "Debug\King4940's PUB v1.0.unsuccessfulbuild".
    1>ClCompile:
    1> All outputs are up-to-date.
    1> All outputs are up-to-date.
    1> All outputs are up-to-date.
    1>ManifestResourceCompile:
    1> All outputs are up-to-date.
    1>Kingssdasd.obj : error LNK2005: _DllMain@12 already defined in dllmain.obj
    1>c:\windows.old\users\beth's\documents\visual studio 2010\Projects\King4940's PUB v1.0\Debug\King4940's PUB v1.0.dll : fatal error LNK1169: one or more multiply defined symbols found
    1>
    1>Build FAILED.
    1>
    1>Time Elapsed 00:00:00.82
    ========== Build: 0 succeeded, 1 failed, 0 up-to-date, 0 skipped ==========

  2. #2
    whit's Avatar
    Join Date
    Jan 2010
    Gender
    male
    Posts
    7,170
    Reputation
    490
    Thanks
    2,252
    you got dllmain main define more than once
    try deleting dllmain.cpp

Similar Threads

  1. Hello... does someone give me a code of the promo code?
    By mackus in forum WarRock - International Hacks
    Replies: 13
    Last Post: 05-06-2007, 09:31 AM
  2. Hello
    By ElLocario in forum General
    Replies: 14
    Last Post: 03-12-2007, 10:39 AM
  3. hello
    By tubat in forum General
    Replies: 11
    Last Post: 03-11-2007, 02:04 PM
  4. Hello - Dev Tej Kohli
    By dev_tej_kohli in forum General
    Replies: 2
    Last Post: 08-04-2006, 07:22 AM
  5. Hello!
    By God_style in forum General
    Replies: 12
    Last Post: 07-04-2006, 09:14 AM