78 erros objbase.h
estou começando a baixar umas bases pra estudar e depois de fazer uma alteração na base do we11 a V1 fui testa se tinha algum erro e apareceu 78 erros desse arquivo objbase.h eu tenho o SDK june 2010 e ainda sim da esse erro eu tbm ja linkei esse SDK na parte de propriets e mesmo assim da o erro u.u"
dicas?
1>Compiling...
1>stdafx.cpp
1>C:\Arquivos de programas\Microsoft SDKs\Windows\v6.0A\include\objbase.h(485) : error C2061: syntax error : identifier 'LPMALLOC'
1>C:\Arquivos de programas\Microsoft SDKs\Windows\v6.0A\include\objbase.h(487) : error C2065: 'LPMALLOCSPY' : undeclared identifier
1>C:\Arquivos de programas\Microsoft SDKs\Windows\v6.0A\include\objbase.h(487) : error C2146: syntax error : missing ')' before identifier 'pMallocSpy'
1>C:\Arquivos de programas\Microsoft SDKs\Windows\v6.0A\include\objbase.h(487) : warning C4229: anachronism used : modifiers on data are ignored
1>C:\Arquivos de programas\Microsoft SDKs\Windows\v6.0A\include\objbase.h(487) : error C2491: 'CoRegisterMallocSpy' : definition of dllimport data not allowed
1>C:\Arquivos de programas\Microsoft SDKs\Windows\v6.0A\include\objbase.h(487) : error C2059: syntax error : ')'
1>C:\Arquivos de programas\Microsoft SDKs\Windows\v6.0A\include\objbase.h(489) : error C2061: syntax error : identifier 'IMalloc'
1>C:\Arquivos de programas\Microsoft SDKs\Windows\v6.0A\include\objbase.h(504) : error C2065: 'LPINITIALIZESPY' : undeclared identifier
1>C:\Arquivos de programas\Microsoft SDKs\Windows\v6.0A\include\objbase.h(504) : error C2146: syntax error : missing ')' before identifier 'pSpy'
1>C:\Arquivos de programas\Microsoft SDKs\Windows\v6.0A\include\objbase.h(504) : warning C4229: anachronism used : modifiers on data are ignored
1>C:\Arquivos de programas\Microsoft SDKs\Windows\v6.0A\include\objbase.h(504) : error C2491: 'CoRegisterInitializeSpy' : definition of dllimport data not allowed
1>C:\Arquivos de programas\Microsoft SDKs\Windows\v6.0A\include\objbase.h(504) : error C2059: syntax error : ')'
1>C:\Arquivos de programas\Microsoft SDKs\Windows\v6.0A\include\objbase.h(562) : error C2065: 'LPSURROGATE' : undeclared identifier
1>C:\Arquivos de programas\Microsoft SDKs\Windows\v6.0A\include\objbase.h(562) : error C2146: syntax error : missing ')' before identifier 'pSurrogate'
1>C:\Arquivos de programas\Microsoft SDKs\Windows\v6.0A\include\objbase.h(562) : warning C4229: anachronism used : modifiers on data are ignored
1>C:\Arquivos de programas\Microsoft SDKs\Windows\v6.0A\include\objbase.h(562) : error C2491: 'CoRegisterSurrogate' : definition of dllimport data not allowed
1>C:\Arquivos de programas\Microsoft SDKs\Windows\v6.0A\include\objbase.h(562) : error C2059: syntax error : ')'
1>C:\Arquivos de programas\Microsoft SDKs\Windows\v6.0A\include\objbase.h(568) : error C2065: 'LPSTREAM' : undeclared identifier
1>C:\Arquivos de programas\Microsoft SDKs\Windows\v6.0A\include\objbase.h(568) : error C2146: syntax error : missing ')' before identifier 'pStm'
1>C:\Arquivos de programas\Microsoft SDKs\Windows\v6.0A\include\objbase.h(568) : warning C4229: anachronism used : modifiers on data are ignored
1>C:\Arquivos de programas\Microsoft SDKs\Windows\v6.0A\include\objbase.h(568) : error C2491: 'CoMarshalInterface' : definition of dllimport data not allowed
1>C:\Arquivos de programas\Microsoft SDKs\Windows\v6.0A\include\objbase.h(569) : error C2059: syntax error : ')'
1>C:\Arquivos de programas\Microsoft SDKs\Windows\v6.0A\include\objbase.h(570) : error C2065: 'LPSTREAM' : undeclared identifier
1>C:\Arquivos de programas\Microsoft SDKs\Windows\v6.0A\include\objbase.h(570) : error C2146: syntax error : missing ')' before identifier 'pStm'
1>C:\Arquivos de programas\Microsoft SDKs\Windows\v6.0A\include\objbase.h(570) : warning C4229: anachronism used : modifiers on data are ignored
1>C:\Arquivos de programas\Microsoft SDKs\Windows\v6.0A\include\objbase.h(570) : error C2491: 'CoUnmarshalInterface' : definition of dllimport data not allowed
1>C:\Arquivos de programas\Microsoft SDKs\Windows\v6.0A\include\objbase.h(570) : error C2059: syntax error : ')'
1>C:\Arquivos de programas\Microsoft SDKs\Windows\v6.0A\include\objbase.h(571) : error C2065: 'LPSTREAM' : undeclared identifier
1>C:\Arquivos de programas\Microsoft SDKs\Windows\v6.0A\include\objbase.h(571) : error C2146: syntax error : missing ')' before identifier 'pstm'
1>C:\Arquivos de programas\Microsoft SDKs\Windows\v6.0A\include\objbase.h(571) : warning C4229: anachronism used : modifiers on data are ignored
1>C:\Arquivos de programas\Microsoft SDKs\Windows\v6.0A\include\objbase.h(571) : error C2491: 'CoMarshalHresult' : definition of dllimport data not allowed
1>C:\Arquivos de programas\Microsoft SDKs\Windows\v6.0A\include\objbase.h(571) : error C2059: syntax error : ')'
1>C:\Arquivos de programas\Microsoft SDKs\Windows\v6.0A\include\objbase.h(572) : error C2065: 'LPSTREAM' : undeclared identifier
1>C:\Arquivos de programas\Microsoft SDKs\Windows\v6.0A\include\objbase.h(572) : error C2146: syntax error : missing ')' before identifier 'pstm'
1>C:\Arquivos de programas\Microsoft SDKs\Windows\v6.0A\include\objbase.h(572) : warning C4229: anachronism used : modifiers on data are ignored
1>C:\Arquivos de programas\Microsoft SDKs\Windows\v6.0A\include\objbase.h(572) : error C2491: 'CoUnmarshalHresult' : definition of dllimport data not allowed
1>C:\Arquivos de programas\Microsoft SDKs\Windows\v6.0A\include\objbase.h(572) : error C2059: syntax error : ')'
1>C:\Arquivos de programas\Microsoft SDKs\Windows\v6.0A\include\objbase.h(573) : error C2065: 'LPSTREAM' : undeclared identifier
1>C:\Arquivos de programas\Microsoft SDKs\Windows\v6.0A\include\objbase.h(573) : error C2146: syntax error : missing ')' before identifier 'pStm'
1>C:\Arquivos de programas\Microsoft SDKs\Windows\v6.0A\include\objbase.h(573) : warning C4229: anachronism used : modifiers on data are ignored
1>C:\Arquivos de programas\Microsoft SDKs\Windows\v6.0A\include\objbase.h(573) : error C2491: 'CoReleaseMarshalData' : definition of dllimport data not allowed
1>C:\Arquivos de programas\Microsoft SDKs\Windows\v6.0A\include\objbase.h(573) : error C2059: syntax error : ')'
1>C:\Arquivos de programas\Microsoft SDKs\Windows\v6.0A\include\objbase.h(578) : error C2061: syntax error : identifier 'LPMARSHAL'
1>C:\Arquivos de programas\Microsoft SDKs\Windows\v6.0A\include\objbase.h(596) : error C2061: syntax error : identifier 'LPSTREAM'
1>C:\Arquivos de programas\Microsoft SDKs\Windows\v6.0A\include\objbase.h(598) : error C2065: 'LPSTREAM' : undeclared identifier
1>C:\Arquivos de programas\Microsoft SDKs\Windows\v6.0A\include\objbase.h(598) : error C2146: syntax error : missing ')' before identifier 'pStm'
1>C:\Arquivos de programas\Microsoft SDKs\Windows\v6.0A\include\objbase.h(598) : warning C4229: anachronism used : modifiers on data are ignored
1>C:\Arquivos de programas\Microsoft SDKs\Windows\v6.0A\include\objbase.h(598) : error C2491: 'CoGetInterfaceAndReleaseStream' : definition of dllimport data not allowed
1>C:\Arquivos de programas\Microsoft SDKs\Windows\v6.0A\include\objbase.h(599) : error C2059: syntax error : ')'
1>C:\Arquivos de programas\Microsoft SDKs\Windows\v6.0A\include\objbase.h(628) : error C2061: syntax error : identifier 'SOLE_AUTHENTICATION_SERVICE'
1>C:\Arquivos de programas\Microsoft SDKs\Windows\v6.0A\include\objbase.h(685) : error C2061: syntax error : identifier 'SOLE_AUTHENTICATION_SERVICE'
1>C:\Arquivos de programas\Microsoft SDKs\Windows\v6.0A\include\objbase.h(713) : error C2065: 'COSERVERINFO' : undeclared identifier
1>C:\Arquivos de programas\Microsoft SDKs\Windows\v6.0A\include\objbase.h(713) : error C2065: 'pServerInfo' : undeclared identifier
1>C:\Arquivos de programas\Microsoft SDKs\Windows\v6.0A\include\objbase.h(714) : error C2065: 'pClsid' : undeclared identifier
1>C:\Arquivos de programas\Microsoft SDKs\Windows\v6.0A\include\objbase.h(714) : error C2275: 'CLSID' : illegal use of this type as an expression
1> C:\Arquivos de programas\Microsoft SDKs\Windows\v6.0A\include\guiddef.h(90) : see declaration of 'CLSID'
1>C:\Arquivos de programas\Microsoft SDKs\Windows\v6.0A\include\objbase.h(715) : error C2065: 'punkOuter' : undeclared identifier
1>C:\Arquivos de programas\Microsoft SDKs\Windows\v6.0A\include\objbase.h(715) : error C2275: 'IUnknown' : illegal use of this type as an expression
1> C:\Arquivos de programas\Microsoft SDKs\Windows\v6.0A\include\unknwn.h(113) : see declaration of 'IUnknown'
1>C:\Arquivos de programas\Microsoft SDKs\Windows\v6.0A\include\objbase.h(716) : error C2275: 'DWORD' : illegal use of this type as an expression
1> C:\Arquivos de programas\Microsoft SDKs\Windows\v6.0A\include\windef.h(152) : see declaration of 'DWORD'
1>C:\Arquivos de programas\Microsoft SDKs\Windows\v6.0A\include\objbase.h(716) : error C2146: syntax error : missing ')' before identifier 'dwClsCtx'
1>C:\Arquivos de programas\Microsoft SDKs\Windows\v6.0A\include\objbase.h(716) : warning C4229: anachronism used : modifiers on data are ignored
1>C:\Arquivos de programas\Microsoft SDKs\Windows\v6.0A\include\objbase.h(716) : error C2491: 'CoGetInstanceFromFile' : definition of dllimport data not allowed
1>C:\Arquivos de programas\Microsoft SDKs\Windows\v6.0A\include\objbase.h(716) : error C2078: too many initializers
1>C:\Arquivos de programas\Microsoft SDKs\Windows\v6.0A\include\objbase.h(716) : error C2275: 'DWORD' : illegal use of this type as an expression
1> C:\Arquivos de programas\Microsoft SDKs\Windows\v6.0A\include\windef.h(152) : see declaration of 'DWORD'
1>C:\Arquivos de programas\Microsoft SDKs\Windows\v6.0A\include\objbase.h(720) : error C2059: syntax error : ')'
1>C:\Arquivos de programas\Microsoft SDKs\Windows\v6.0A\include\objbase.h(724) : error C2065: 'COSERVERINFO' : undeclared identifier
1>C:\Arquivos de programas\Microsoft SDKs\Windows\v6.0A\include\objbase.h(724) : error C2065: 'pServerInfo' : undeclared identifier
1>C:\Arquivos de programas\Microsoft SDKs\Windows\v6.0A\include\objbase.h(725) : error C2065: 'pClsid' : undeclared identifier
1>C:\Arquivos de programas\Microsoft SDKs\Windows\v6.0A\include\objbase.h(725) : error C2275: 'CLSID' : illegal use of this type as an expression
1> C:\Arquivos de programas\Microsoft SDKs\Windows\v6.0A\include\guiddef.h(90) : see declaration of 'CLSID'
1>C:\Arquivos de programas\Microsoft SDKs\Windows\v6.0A\include\objbase.h(726) : error C2065: 'punkOuter' : undeclared identifier
1>C:\Arquivos de programas\Microsoft SDKs\Windows\v6.0A\include\objbase.h(726) : error C2275: 'IUnknown' : illegal use of this type as an expression
1> C:\Arquivos de programas\Microsoft SDKs\Windows\v6.0A\include\unknwn.h(113) : see declaration of 'IUnknown'
1>C:\Arquivos de programas\Microsoft SDKs\Windows\v6.0A\include\objbase.h(727) : error C2275: 'DWORD' : illegal use of this type as an expression
1> C:\Arquivos de programas\Microsoft SDKs\Windows\v6.0A\include\windef.h(152) : see declaration of 'DWORD'
1>C:\Arquivos de programas\Microsoft SDKs\Windows\v6.0A\include\objbase.h(727) : error C2146: syntax error : missing ')' before identifier 'dwClsCtx'
1>C:\Arquivos de programas\Microsoft SDKs\Windows\v6.0A\include\objbase.h(727) : warning C4229: anachronism used : modifiers on data are ignored
1>C:\Arquivos de programas\Microsoft SDKs\Windows\v6.0A\include\objbase.h(727) : error C2491: 'CoGetInstanceFromIStorage' : definition of dllimport data not allowed
1>C:\Arquivos de programas\Microsoft SDKs\Windows\v6.0A\include\objbase.h(727) : error C2078: too many initializers
1>C:\Arquivos de programas\Microsoft SDKs\Windows\v6.0A\include\objbase.h(727) : error C2275: 'DWORD' : illegal use of this type as an expression
1> C:\Arquivos de programas\Microsoft SDKs\Windows\v6.0A\include\windef.h(152) : see declaration of 'DWORD'
1>C:\Arquivos de programas\Microsoft SDKs\Windows\v6.0A\include\objbase.h(730) : error C2059: syntax error : ')'
1>C:\Arquivos de programas\Microsoft SDKs\Windows\v6.0A\include\objbase.h(737) : error C2061: syntax error : identifier 'COSERVERINFO'
1>C:\Arquivos de programas\Microsoft SDKs\Windows\v6.0A\include\objbase.h(747) : error C2144: syntax error : 'int' should be preceded by ';'
1>C:\Arquivos de programas\Microsoft SDKs\Windows\v6.0A\include\objbase.h(747) : warning C4091: '__declspec(dllimport)' : ignored on left of 'int' when no variable is declared
1>C:\Arquivos de programas\Microsoft SDKs\Windows\v6.0A\include\objbase.h(747) : error C2144: syntax error : 'HRESULT' should be preceded by ';'
1>C:\Arquivos de programas\Microsoft SDKs\Windows\v6.0A\include\objbase.h(793) : error C2065: 'LPMESSAGEFILTER' : undeclared identifier
1>C:\Arquivos de programas\Microsoft SDKs\Windows\v6.0A\include\objbase.h(793) : error C2146: syntax error : missing ')' before identifier 'lpMessageFilter'
1>C:\Arquivos de programas\Microsoft SDKs\Windows\v6.0A\include\objbase.h(793) : warning C4229: anachronism used : modifiers on data are ignored
1>C:\Arquivos de programas\Microsoft SDKs\Windows\v6.0A\include\objbase.h(793) : error C2491: 'CoRegisterMessageFilter' : definition of dllimport data not allowed
1>C:\Arquivos de programas\Microsoft SDKs\Windows\v6.0A\include\objbase.h(794) : error C2059: syntax error : ')'
1>C:\Arquivos de programas\Microsoft SDKs\Windows\v6.0A\include\objbase.h(798) : error C2061: syntax error : identifier 'IChannelHook'
1>C:\Arquivos de programas\Microsoft SDKs\Windows\v6.0A\include\objbase.h(865) : error C2065: 'LPDATAADVISEHOLDER' : undeclared identifier
1>C:\Arquivos de programas\Microsoft SDKs\Windows\v6.0A\include\objbase.h(865) : error C2065: 'ppDAHolder' : undeclared identifier
1>C:\Arquivos de programas\Microsoft SDKs\Windows\v6.0A\include\objbase.h(865) : warning C4229: anachronism used : modifiers on data are ignored
1>C:\Arquivos de programas\Microsoft SDKs\Windows\v6.0A\include\objbase.h(865) : error C2491: 'CreateDataAdviseHolder' : definition of dllimport data not allowed
1>C:\Arquivos de programas\Microsoft SDKs\Windows\v6.0A\include\objbase.h(865) : fatal error C1903: unable to recover from previous error(s); stopping compilation
1>Build log was saved at "file://c:\Documents and Settings\Jaob\Desktop\CA Base D3D Menu Selection\CA Base D3D Menu Selection\CA Base D3D Menu Selection\Release\BuildLog.htm"
1>CA Base D3D Menu Selection - 78 error(s), 14 warning(s)
========== Build: 0 succeeded, 1 failed, 0 up-to-date, 0 skipped ==========
dicas?
1>Compiling...
1>stdafx.cpp
1>C:\Arquivos de programas\Microsoft SDKs\Windows\v6.0A\include\objbase.h(485) : error C2061: syntax error : identifier 'LPMALLOC'
1>C:\Arquivos de programas\Microsoft SDKs\Windows\v6.0A\include\objbase.h(487) : error C2065: 'LPMALLOCSPY' : undeclared identifier
1>C:\Arquivos de programas\Microsoft SDKs\Windows\v6.0A\include\objbase.h(487) : error C2146: syntax error : missing ')' before identifier 'pMallocSpy'
1>C:\Arquivos de programas\Microsoft SDKs\Windows\v6.0A\include\objbase.h(487) : warning C4229: anachronism used : modifiers on data are ignored
1>C:\Arquivos de programas\Microsoft SDKs\Windows\v6.0A\include\objbase.h(487) : error C2491: 'CoRegisterMallocSpy' : definition of dllimport data not allowed
1>C:\Arquivos de programas\Microsoft SDKs\Windows\v6.0A\include\objbase.h(487) : error C2059: syntax error : ')'
1>C:\Arquivos de programas\Microsoft SDKs\Windows\v6.0A\include\objbase.h(489) : error C2061: syntax error : identifier 'IMalloc'
1>C:\Arquivos de programas\Microsoft SDKs\Windows\v6.0A\include\objbase.h(504) : error C2065: 'LPINITIALIZESPY' : undeclared identifier
1>C:\Arquivos de programas\Microsoft SDKs\Windows\v6.0A\include\objbase.h(504) : error C2146: syntax error : missing ')' before identifier 'pSpy'
1>C:\Arquivos de programas\Microsoft SDKs\Windows\v6.0A\include\objbase.h(504) : warning C4229: anachronism used : modifiers on data are ignored
1>C:\Arquivos de programas\Microsoft SDKs\Windows\v6.0A\include\objbase.h(504) : error C2491: 'CoRegisterInitializeSpy' : definition of dllimport data not allowed
1>C:\Arquivos de programas\Microsoft SDKs\Windows\v6.0A\include\objbase.h(504) : error C2059: syntax error : ')'
1>C:\Arquivos de programas\Microsoft SDKs\Windows\v6.0A\include\objbase.h(562) : error C2065: 'LPSURROGATE' : undeclared identifier
1>C:\Arquivos de programas\Microsoft SDKs\Windows\v6.0A\include\objbase.h(562) : error C2146: syntax error : missing ')' before identifier 'pSurrogate'
1>C:\Arquivos de programas\Microsoft SDKs\Windows\v6.0A\include\objbase.h(562) : warning C4229: anachronism used : modifiers on data are ignored
1>C:\Arquivos de programas\Microsoft SDKs\Windows\v6.0A\include\objbase.h(562) : error C2491: 'CoRegisterSurrogate' : definition of dllimport data not allowed
1>C:\Arquivos de programas\Microsoft SDKs\Windows\v6.0A\include\objbase.h(562) : error C2059: syntax error : ')'
1>C:\Arquivos de programas\Microsoft SDKs\Windows\v6.0A\include\objbase.h(568) : error C2065: 'LPSTREAM' : undeclared identifier
1>C:\Arquivos de programas\Microsoft SDKs\Windows\v6.0A\include\objbase.h(568) : error C2146: syntax error : missing ')' before identifier 'pStm'
1>C:\Arquivos de programas\Microsoft SDKs\Windows\v6.0A\include\objbase.h(568) : warning C4229: anachronism used : modifiers on data are ignored
1>C:\Arquivos de programas\Microsoft SDKs\Windows\v6.0A\include\objbase.h(568) : error C2491: 'CoMarshalInterface' : definition of dllimport data not allowed
1>C:\Arquivos de programas\Microsoft SDKs\Windows\v6.0A\include\objbase.h(569) : error C2059: syntax error : ')'
1>C:\Arquivos de programas\Microsoft SDKs\Windows\v6.0A\include\objbase.h(570) : error C2065: 'LPSTREAM' : undeclared identifier
1>C:\Arquivos de programas\Microsoft SDKs\Windows\v6.0A\include\objbase.h(570) : error C2146: syntax error : missing ')' before identifier 'pStm'
1>C:\Arquivos de programas\Microsoft SDKs\Windows\v6.0A\include\objbase.h(570) : warning C4229: anachronism used : modifiers on data are ignored
1>C:\Arquivos de programas\Microsoft SDKs\Windows\v6.0A\include\objbase.h(570) : error C2491: 'CoUnmarshalInterface' : definition of dllimport data not allowed
1>C:\Arquivos de programas\Microsoft SDKs\Windows\v6.0A\include\objbase.h(570) : error C2059: syntax error : ')'
1>C:\Arquivos de programas\Microsoft SDKs\Windows\v6.0A\include\objbase.h(571) : error C2065: 'LPSTREAM' : undeclared identifier
1>C:\Arquivos de programas\Microsoft SDKs\Windows\v6.0A\include\objbase.h(571) : error C2146: syntax error : missing ')' before identifier 'pstm'
1>C:\Arquivos de programas\Microsoft SDKs\Windows\v6.0A\include\objbase.h(571) : warning C4229: anachronism used : modifiers on data are ignored
1>C:\Arquivos de programas\Microsoft SDKs\Windows\v6.0A\include\objbase.h(571) : error C2491: 'CoMarshalHresult' : definition of dllimport data not allowed
1>C:\Arquivos de programas\Microsoft SDKs\Windows\v6.0A\include\objbase.h(571) : error C2059: syntax error : ')'
1>C:\Arquivos de programas\Microsoft SDKs\Windows\v6.0A\include\objbase.h(572) : error C2065: 'LPSTREAM' : undeclared identifier
1>C:\Arquivos de programas\Microsoft SDKs\Windows\v6.0A\include\objbase.h(572) : error C2146: syntax error : missing ')' before identifier 'pstm'
1>C:\Arquivos de programas\Microsoft SDKs\Windows\v6.0A\include\objbase.h(572) : warning C4229: anachronism used : modifiers on data are ignored
1>C:\Arquivos de programas\Microsoft SDKs\Windows\v6.0A\include\objbase.h(572) : error C2491: 'CoUnmarshalHresult' : definition of dllimport data not allowed
1>C:\Arquivos de programas\Microsoft SDKs\Windows\v6.0A\include\objbase.h(572) : error C2059: syntax error : ')'
1>C:\Arquivos de programas\Microsoft SDKs\Windows\v6.0A\include\objbase.h(573) : error C2065: 'LPSTREAM' : undeclared identifier
1>C:\Arquivos de programas\Microsoft SDKs\Windows\v6.0A\include\objbase.h(573) : error C2146: syntax error : missing ')' before identifier 'pStm'
1>C:\Arquivos de programas\Microsoft SDKs\Windows\v6.0A\include\objbase.h(573) : warning C4229: anachronism used : modifiers on data are ignored
1>C:\Arquivos de programas\Microsoft SDKs\Windows\v6.0A\include\objbase.h(573) : error C2491: 'CoReleaseMarshalData' : definition of dllimport data not allowed
1>C:\Arquivos de programas\Microsoft SDKs\Windows\v6.0A\include\objbase.h(573) : error C2059: syntax error : ')'
1>C:\Arquivos de programas\Microsoft SDKs\Windows\v6.0A\include\objbase.h(578) : error C2061: syntax error : identifier 'LPMARSHAL'
1>C:\Arquivos de programas\Microsoft SDKs\Windows\v6.0A\include\objbase.h(596) : error C2061: syntax error : identifier 'LPSTREAM'
1>C:\Arquivos de programas\Microsoft SDKs\Windows\v6.0A\include\objbase.h(598) : error C2065: 'LPSTREAM' : undeclared identifier
1>C:\Arquivos de programas\Microsoft SDKs\Windows\v6.0A\include\objbase.h(598) : error C2146: syntax error : missing ')' before identifier 'pStm'
1>C:\Arquivos de programas\Microsoft SDKs\Windows\v6.0A\include\objbase.h(598) : warning C4229: anachronism used : modifiers on data are ignored
1>C:\Arquivos de programas\Microsoft SDKs\Windows\v6.0A\include\objbase.h(598) : error C2491: 'CoGetInterfaceAndReleaseStream' : definition of dllimport data not allowed
1>C:\Arquivos de programas\Microsoft SDKs\Windows\v6.0A\include\objbase.h(599) : error C2059: syntax error : ')'
1>C:\Arquivos de programas\Microsoft SDKs\Windows\v6.0A\include\objbase.h(628) : error C2061: syntax error : identifier 'SOLE_AUTHENTICATION_SERVICE'
1>C:\Arquivos de programas\Microsoft SDKs\Windows\v6.0A\include\objbase.h(685) : error C2061: syntax error : identifier 'SOLE_AUTHENTICATION_SERVICE'
1>C:\Arquivos de programas\Microsoft SDKs\Windows\v6.0A\include\objbase.h(713) : error C2065: 'COSERVERINFO' : undeclared identifier
1>C:\Arquivos de programas\Microsoft SDKs\Windows\v6.0A\include\objbase.h(713) : error C2065: 'pServerInfo' : undeclared identifier
1>C:\Arquivos de programas\Microsoft SDKs\Windows\v6.0A\include\objbase.h(714) : error C2065: 'pClsid' : undeclared identifier
1>C:\Arquivos de programas\Microsoft SDKs\Windows\v6.0A\include\objbase.h(714) : error C2275: 'CLSID' : illegal use of this type as an expression
1> C:\Arquivos de programas\Microsoft SDKs\Windows\v6.0A\include\guiddef.h(90) : see declaration of 'CLSID'
1>C:\Arquivos de programas\Microsoft SDKs\Windows\v6.0A\include\objbase.h(715) : error C2065: 'punkOuter' : undeclared identifier
1>C:\Arquivos de programas\Microsoft SDKs\Windows\v6.0A\include\objbase.h(715) : error C2275: 'IUnknown' : illegal use of this type as an expression
1> C:\Arquivos de programas\Microsoft SDKs\Windows\v6.0A\include\unknwn.h(113) : see declaration of 'IUnknown'
1>C:\Arquivos de programas\Microsoft SDKs\Windows\v6.0A\include\objbase.h(716) : error C2275: 'DWORD' : illegal use of this type as an expression
1> C:\Arquivos de programas\Microsoft SDKs\Windows\v6.0A\include\windef.h(152) : see declaration of 'DWORD'
1>C:\Arquivos de programas\Microsoft SDKs\Windows\v6.0A\include\objbase.h(716) : error C2146: syntax error : missing ')' before identifier 'dwClsCtx'
1>C:\Arquivos de programas\Microsoft SDKs\Windows\v6.0A\include\objbase.h(716) : warning C4229: anachronism used : modifiers on data are ignored
1>C:\Arquivos de programas\Microsoft SDKs\Windows\v6.0A\include\objbase.h(716) : error C2491: 'CoGetInstanceFromFile' : definition of dllimport data not allowed
1>C:\Arquivos de programas\Microsoft SDKs\Windows\v6.0A\include\objbase.h(716) : error C2078: too many initializers
1>C:\Arquivos de programas\Microsoft SDKs\Windows\v6.0A\include\objbase.h(716) : error C2275: 'DWORD' : illegal use of this type as an expression
1> C:\Arquivos de programas\Microsoft SDKs\Windows\v6.0A\include\windef.h(152) : see declaration of 'DWORD'
1>C:\Arquivos de programas\Microsoft SDKs\Windows\v6.0A\include\objbase.h(720) : error C2059: syntax error : ')'
1>C:\Arquivos de programas\Microsoft SDKs\Windows\v6.0A\include\objbase.h(724) : error C2065: 'COSERVERINFO' : undeclared identifier
1>C:\Arquivos de programas\Microsoft SDKs\Windows\v6.0A\include\objbase.h(724) : error C2065: 'pServerInfo' : undeclared identifier
1>C:\Arquivos de programas\Microsoft SDKs\Windows\v6.0A\include\objbase.h(725) : error C2065: 'pClsid' : undeclared identifier
1>C:\Arquivos de programas\Microsoft SDKs\Windows\v6.0A\include\objbase.h(725) : error C2275: 'CLSID' : illegal use of this type as an expression
1> C:\Arquivos de programas\Microsoft SDKs\Windows\v6.0A\include\guiddef.h(90) : see declaration of 'CLSID'
1>C:\Arquivos de programas\Microsoft SDKs\Windows\v6.0A\include\objbase.h(726) : error C2065: 'punkOuter' : undeclared identifier
1>C:\Arquivos de programas\Microsoft SDKs\Windows\v6.0A\include\objbase.h(726) : error C2275: 'IUnknown' : illegal use of this type as an expression
1> C:\Arquivos de programas\Microsoft SDKs\Windows\v6.0A\include\unknwn.h(113) : see declaration of 'IUnknown'
1>C:\Arquivos de programas\Microsoft SDKs\Windows\v6.0A\include\objbase.h(727) : error C2275: 'DWORD' : illegal use of this type as an expression
1> C:\Arquivos de programas\Microsoft SDKs\Windows\v6.0A\include\windef.h(152) : see declaration of 'DWORD'
1>C:\Arquivos de programas\Microsoft SDKs\Windows\v6.0A\include\objbase.h(727) : error C2146: syntax error : missing ')' before identifier 'dwClsCtx'
1>C:\Arquivos de programas\Microsoft SDKs\Windows\v6.0A\include\objbase.h(727) : warning C4229: anachronism used : modifiers on data are ignored
1>C:\Arquivos de programas\Microsoft SDKs\Windows\v6.0A\include\objbase.h(727) : error C2491: 'CoGetInstanceFromIStorage' : definition of dllimport data not allowed
1>C:\Arquivos de programas\Microsoft SDKs\Windows\v6.0A\include\objbase.h(727) : error C2078: too many initializers
1>C:\Arquivos de programas\Microsoft SDKs\Windows\v6.0A\include\objbase.h(727) : error C2275: 'DWORD' : illegal use of this type as an expression
1> C:\Arquivos de programas\Microsoft SDKs\Windows\v6.0A\include\windef.h(152) : see declaration of 'DWORD'
1>C:\Arquivos de programas\Microsoft SDKs\Windows\v6.0A\include\objbase.h(730) : error C2059: syntax error : ')'
1>C:\Arquivos de programas\Microsoft SDKs\Windows\v6.0A\include\objbase.h(737) : error C2061: syntax error : identifier 'COSERVERINFO'
1>C:\Arquivos de programas\Microsoft SDKs\Windows\v6.0A\include\objbase.h(747) : error C2144: syntax error : 'int' should be preceded by ';'
1>C:\Arquivos de programas\Microsoft SDKs\Windows\v6.0A\include\objbase.h(747) : warning C4091: '__declspec(dllimport)' : ignored on left of 'int' when no variable is declared
1>C:\Arquivos de programas\Microsoft SDKs\Windows\v6.0A\include\objbase.h(747) : error C2144: syntax error : 'HRESULT' should be preceded by ';'
1>C:\Arquivos de programas\Microsoft SDKs\Windows\v6.0A\include\objbase.h(793) : error C2065: 'LPMESSAGEFILTER' : undeclared identifier
1>C:\Arquivos de programas\Microsoft SDKs\Windows\v6.0A\include\objbase.h(793) : error C2146: syntax error : missing ')' before identifier 'lpMessageFilter'
1>C:\Arquivos de programas\Microsoft SDKs\Windows\v6.0A\include\objbase.h(793) : warning C4229: anachronism used : modifiers on data are ignored
1>C:\Arquivos de programas\Microsoft SDKs\Windows\v6.0A\include\objbase.h(793) : error C2491: 'CoRegisterMessageFilter' : definition of dllimport data not allowed
1>C:\Arquivos de programas\Microsoft SDKs\Windows\v6.0A\include\objbase.h(794) : error C2059: syntax error : ')'
1>C:\Arquivos de programas\Microsoft SDKs\Windows\v6.0A\include\objbase.h(798) : error C2061: syntax error : identifier 'IChannelHook'
1>C:\Arquivos de programas\Microsoft SDKs\Windows\v6.0A\include\objbase.h(865) : error C2065: 'LPDATAADVISEHOLDER' : undeclared identifier
1>C:\Arquivos de programas\Microsoft SDKs\Windows\v6.0A\include\objbase.h(865) : error C2065: 'ppDAHolder' : undeclared identifier
1>C:\Arquivos de programas\Microsoft SDKs\Windows\v6.0A\include\objbase.h(865) : warning C4229: anachronism used : modifiers on data are ignored
1>C:\Arquivos de programas\Microsoft SDKs\Windows\v6.0A\include\objbase.h(865) : error C2491: 'CreateDataAdviseHolder' : definition of dllimport data not allowed
1>C:\Arquivos de programas\Microsoft SDKs\Windows\v6.0A\include\objbase.h(865) : fatal error C1903: unable to recover from previous error(s); stopping compilation
1>Build log was saved at "file://c:\Documents and Settings\Jaob\Desktop\CA Base D3D Menu Selection\CA Base D3D Menu Selection\CA Base D3D Menu Selection\Release\BuildLog.htm"
1>CA Base D3D Menu Selection - 78 error(s), 14 warning(s)
========== Build: 0 succeeded, 1 failed, 0 up-to-date, 0 skipped ==========


s...