Compilação
1>------ Build started: Project: CA Base D3D Menu Selection, Configuration: Debug Win32 ------
1>Compiling...
1>Hack.cpp
1>c:\users\usuario\documents\vinicius\mpgh\program ação\bases\ca base d3d menu selection\ca base d3d menu selection\hack.cpp(156) : error C2601: 'Hook' : local function definitions are illegal
1> c:\users\usuario\documents\vinicius\mpgh\programaç ão\bases\ca base d3d menu selection\ca base d3d menu selection\hack.cpp(47): this line contains a '{' which has not yet been matched
1>c:\users\usuario\documents\vinicius\mpgh\program ação\bases\ca base d3d menu selection\ca base d3d menu selection\hack.cpp(172) : fatal error C1075: end of file found before the left brace '{' at 'c:\users\usuario\documents\vinicius\mpgh\programa ção\bases\ca base d3d menu selection\ca base d3d menu selection\hack.cpp(47)' was matched
1>Build log was saved at "file://c:\Users\Usuario\Documents\Vinicius\MPGH\Programaç ão\Bases\CA Base D3D Menu Selection\CA Base D3D Menu Selection\Debug\BuildLog.htm"
1>CA Base D3D Menu Selection - 2 error(s), 0 warning(s)
========== Build: 0 succeeded, 1 failed, 0 up-to-date, 0 skipped ==========
1>Compiling...
1>Hack.cpp
1>c:\users\usuario\documents\vinicius\mpgh\program ação\bases\ca base d3d menu selection\ca base d3d menu selection\hack.cpp(156) : error C2601: 'Hook' : local function definitions are illegal
1> c:\users\usuario\documents\vinicius\mpgh\programaç ão\bases\ca base d3d menu selection\ca base d3d menu selection\hack.cpp(47): this line contains a '{' which has not yet been matched
1>c:\users\usuario\documents\vinicius\mpgh\program ação\bases\ca base d3d menu selection\ca base d3d menu selection\hack.cpp(172) : fatal error C1075: end of file found before the left brace '{' at 'c:\users\usuario\documents\vinicius\mpgh\programa ção\bases\ca base d3d menu selection\ca base d3d menu selection\hack.cpp(47)' was matched
1>Build log was saved at "file://c:\Users\Usuario\Documents\Vinicius\MPGH\Programaç ão\Bases\CA Base D3D Menu Selection\CA Base D3D Menu Selection\Debug\BuildLog.htm"
1>CA Base D3D Menu Selection - 2 error(s), 0 warning(s)
========== Build: 0 succeeded, 1 failed, 0 up-to-date, 0 skipped ==========
