😳 [Tutorial]How to make Your own Injector

Posts 1–15 of 18 · Page 1 of 2
😳 [Tutorial]How to make Your own Injector
Download Microsoft Visual Basic 2008 Express Edition Or Just Anything Visual C++ Or Dev+
Before you start Disable your anti-virus
1.Open New Project and name it how ever you like

2.Rename Form1 to something i did my like RikuoII Auto Injector

3.Make next things:
A.1 of ButtonBox
B.4 of Labels
C.2 TextBox
D.Timer
E.OpenFileDialog

4.Rename Button1 to "Browse..."

5:↓↓↓
A.Make sure that you don't do anything with Label1 its important
B.Rename Label2 to "Process Name:" and in front of it put TextBox1
C.Rename Label3 to "DLL to inject" and in front of it put TextBox2 and Browse... button

6.When you get all of that done,Download My Source Code
Copy everything from it...than go back to Visual Basic and DoubleClick Anywhere to open CodeView

7.in CodeView Delete EVERYTHING and paste the code (download the code on Attachment)

8.Enable Debugging and Your Injector will pop-up,if it doesn't than that means you have an error in CodeView

9.If you are good programmer you can fix it Manually
DO NOT FIX IT AUTO*you will just have to do everything again*
if you can't fix it contact me
but i checked the code 2 times and everything seems fine and i made 1 injectors with it

10.Go to File>Save All...

11.Name it what ever you like and Save it

12..go to Folder you saved it Bin>Debug find file and open it

Test is it working..

Well Have FUN Tnx to me



Injetor Source Code.txt5 KB · 274 downloads Clean
thx amzing it works

---------- Post added at 02:12 PM ---------- Previous post was at 01:51 PM ----------

but only promblem it dosent inject can u help me>#?
Quote Originally Posted by THEBOYZRULE View Post
thx amzing it works

---------- Post added at 02:12 PM ---------- Previous post was at 01:51 PM ----------

but only promblem it dosent inject can u help me>#?
Its Auto inject
Quote Originally Posted by RikuoII View Post
Its Auto inject
it dosent work

---------- Post added at 07:16 AM ---------- Previous post was at 07:16 AM ----------

can u try to uptade and put manual ?

---------- Post added at 07:18 AM ---------- Previous post was at 07:16 AM ----------

dose it only work on warrock?

---------- Post added at 07:18 AM ---------- Previous post was at 07:18 AM ----------

becuase i dont play warock i play crossfire

---------- Post added at 07:22 AM ---------- Previous post was at 07:18 AM ----------

oh yea and one more thing i have a promblem making a Credits button can u or anyone give me code ?
Quote Originally Posted by THEBOYZRULE View Post

[/COLOR]oh yea and one more thing i have a promblem making a Credits button can u or anyone give me code ?
@THEBOYZRULE
Code:
MsgBox("Your message here.", MsgBoxStyle.OkOnly, "Credits")
Quote Originally Posted by Katy View Post
[COLOR="SandyBrown"]
@THEBOYZRULE
Code:
MsgBox("Your message here.", MsgBoxStyle.OkOnly, "Credits")
WELCOME TO OUR SECTION ..
I don't understand well Can you Say More Simply ?
And have a Problem in My VB2008 .every code that i see has Errors if i Erase the First Code When i Doubled Click On It T.T

---------- Post added at 09:36 AM ---------- Previous post was at 09:04 AM ----------

Here is the F*CK*NG Code i've Got When i Double Click The Form T.T
Code:
#pragma once


namespace Try {

	using namespace System;
	using namespace System::ComponentModel;
	using namespace System::Collections;
	using namespace System::Windows::Forms;
	using namespace System::Data;
	using namespace System::Drawing;

	/// <summary>
	/// Summary for Form1
	///
	/// WARNING: If you change the name of this class, you will need to change the
	///          'Resource File Name' property for the managed resource compiler tool
	///          associated with all .resx files this class depends on.  Otherwise,
	///          the designers will not be able to interact properly with localized
	///          resources associated with this form.
	/// </summary>
	public ref class Form1 : public System::Windows::Forms::Form
	{
	public:
		Form1(void)
		{
			InitializeComponent();
			//
			//TODO: Add the constructor code here
			//
		}

	protected:
		/// <summary>
		/// Clean up any resources being used.
		/// </summary>
		~Form1()
		{
			if (components)
			{
				delete components;
			}
		}
	private: System::Windows::Forms::Button^  button1;
	protected: 
	private: System::Windows::Forms::Label^  label1;
	private: System::Windows::Forms::Label^  label2;
	private: System::Windows::Forms::Label^  label3;
	private: System::Windows::Forms::TextBox^  textBox1;
	private: System::Windows::Forms::TextBox^  textBox2;
	private: System::Windows::Forms::Timer^  timer1;
	private: System::Windows::Forms::OpenFileDialog^  openFileDialog1;
	private: System::ComponentModel::IContainer^  components;

	private:
		/// <summary>
		/// Required designer variable.
		/// </summary>


#pragma region Windows Form Designer generated code
		/// <summary>
		/// Required method for Designer support - do not modify
		/// the contents of this method with the code editor.
		/// </summary>
		void InitializeComponent(void)
		{
			this->components = (gcnew System::ComponentModel::Container());
			this->button1 = (gcnew System::Windows::Forms::Button());
			this->label1 = (gcnew System::Windows::Forms::Label());
			this->label2 = (gcnew System::Windows::Forms::Label());
			this->label3 = (gcnew System::Windows::Forms::Label());
			this->textBox1 = (gcnew System::Windows::Forms::TextBox());
			this->textBox2 = (gcnew System::Windows::Forms::TextBox());
			this->timer1 = (gcnew System::Windows::Forms::Timer(this->components));
			this->openFileDialog1 = (gcnew System::Windows::Forms::OpenFileDialog());
			this->SuspendLayout();
			// 
			// button1
			// 
			this->button1->Location = System::Drawing::Point(85, 137);
			this->button1->Name = L"button1";
			this->button1->Size = System::Drawing::Size(114, 35);
			this->button1->TabIndex = 0;
			this->button1->Text = L"Browse";
			this->button1->UseVisualStyleBackColor = true;
			// 
			// label1
			// 
			this->label1->AutoSize = true;
			this->label1->Location = System::Drawing::Point(9, 244);
			this->label1->Name = L"label1";
			this->label1->Size = System::Drawing::Size(35, 13);
			this->label1->TabIndex = 1;
			this->label1->Text = L"label1";
			// 
			// label2
			// 
			this->label2->AutoSize = true;
			this->label2->Location = System::Drawing::Point(10, 19);
			this->label2->Name = L"label2";
			this->label2->Size = System::Drawing::Size(79, 13);
			this->label2->TabIndex = 2;
			this->label2->Text = L"Process Name:";
			// 
			// label3
			// 
			this->label3->AutoSize = true;
			this->label3->Location = System::Drawing::Point(12, 74);
			this->label3->Name = L"label3";
			this->label3->Size = System::Drawing::Size(67, 13);
			this->label3->TabIndex = 3;
			this->label3->Text = L"Dll To Inject:";
			// 
			// textBox1
			// 
			this->textBox1->Location = System::Drawing::Point(13, 41);
			this->textBox1->Name = L"textBox1";
			this->textBox1->Size = System::Drawing::Size(268, 20);
			this->textBox1->TabIndex = 4;
			// 
			// textBox2
			// 
			this->textBox2->Location = System::Drawing::Point(17, 104);
			this->textBox2->Name = L"textBox2";
			this->textBox2->Size = System::Drawing::Size(263, 20);
			this->textBox2->TabIndex = 5;
			// 
			// openFileDialog1
			// 
			this->openFileDialog1->FileName = L"openFileDialog1";
			// 
			// Form1
			// 
			this->AutoScaleDimensions = System::Drawing::SizeF(6, 13);
			this->AutoScaleMode = System::Windows::Forms::AutoScaleMode::Font;
			this->ClientSize = System::Drawing::Size(292, 273);
			this->Controls->Add(this->textBox2);
			this->Controls->Add(this->textBox1);
			this->Controls->Add(this->label3);
			this->Controls->Add(this->label2);
			this->Controls->Add(this->label1);
			this->Controls->Add(this->button1);
			this->Name = L"Form1";
			this->Text = L"Injector";
			this->Load += gcnew System::EventHandler(this, &Form1::Form1_Load);
			this->ResumeLayout(false);
			this->PerformLayout();

		}
#pragma endregion
	private: System::Void Form1_Load(System::Object^  sender, System::EventArgs^  e) {
			 }
};
}
Anyone Help Me?

But When i Delete Those Code Get This.


But When I don't Delete Those Codes and Paste Yours.
I Get These Errors:

Code:
1>------ Build started: Project: Try, Configuration: Debug Win32 ------
1>Compiling...
1>stdafx.cpp
1>Compiling...
1>AssemblyInfo.cpp
1>Try.cpp
1>c:\documents and settings\victor palad\my documents\visual studio 2008\projects\try\Form1.h(157) : error C2146: syntax error : missing ';' before identifier 'Class'
1>c:\documents and settings\victor palad\my documents\visual studio 2008\projects\try\Form1.h(157) : error C4430: missing type specifier - int assumed. Note: C++ does not support default-int
1>c:\documents and settings\victor palad\my documents\visual studio 2008\projects\try\Form1.h(158) : error C2146: syntax error : missing ';' before identifier 'Form1'
1>c:\documents and settings\victor palad\my documents\visual studio 2008\projects\try\Form1.h(158) : error C4430: missing type specifier - int assumed. Note: C++ does not support default-int
1>c:\documents and settings\victor palad\my documents\visual studio 2008\projects\try\Form1.h(158) : error C2146: syntax error : missing ';' before identifier 'Private'
1>c:\documents and settings\victor palad\my documents\visual studio 2008\projects\try\Form1.h(158) : error C4430: missing type specifier - int assumed. Note: C++ does not support default-int
1>c:\documents and settings\victor palad\my documents\visual studio 2008\projects\try\Form1.h(158) : error C2146: syntax error : missing ';' before identifier 'TargetProcessHandle'
1>c:\documents and settings\victor palad\my documents\visual studio 2008\projects\try\Form1.h(158) : error C4430: missing type specifier - int assumed. Note: C++ does not support default-int
1>c:\documents and settings\victor palad\my documents\visual studio 2008\projects\try\Form1.h(158) : error C2146: syntax error : missing ';' before identifier 'As'
1>c:\documents and settings\victor palad\my documents\visual studio 2008\projects\try\Form1.h(158) : error C4430: missing type specifier - int assumed. Note: C++ does not support default-int
1>c:\documents and settings\victor palad\my documents\visual studio 2008\projects\try\Form1.h(159) : error C2146: syntax error : missing ';' before identifier 'Integer'
1>c:\documents and settings\victor palad\my documents\visual studio 2008\projects\try\Form1.h(159) : error C4430: missing type specifier - int assumed. Note: C++ does not support default-int
1>c:\documents and settings\victor palad\my documents\visual studio 2008\projects\try\Form1.h(159) : error C2146: syntax error : missing ';' before identifier 'Private'
1>c:\documents and settings\victor palad\my documents\visual studio 2008\projects\try\Form1.h(159) : error C4430: missing type specifier - int assumed. Note: C++ does not support default-int
1>c:\documents and settings\victor palad\my documents\visual studio 2008\projects\try\Form1.h(159) : error C2146: syntax error : missing ';' before identifier 'pfnStartAddr'
1>c:\documents and settings\victor palad\my documents\visual studio 2008\projects\try\Form1.h(159) : error C4430: missing type specifier - int assumed. Note: C++ does not support default-int
1>c:\documents and settings\victor palad\my documents\visual studio 2008\projects\try\Form1.h(159) : error C2086: 'int Private' : redefinition
1>        c:\documents and settings\victor palad\my documents\visual studio 2008\projects\try\Form1.h(158) : see declaration of 'Private'
1>c:\documents and settings\victor palad\my documents\visual studio 2008\projects\try\Form1.h(159) : error C2146: syntax error : missing ';' before identifier 'As'
1>c:\documents and settings\victor palad\my documents\visual studio 2008\projects\try\Form1.h(159) : error C4430: missing type specifier - int assumed. Note: C++ does not support default-int
1>c:\documents and settings\victor palad\my documents\visual studio 2008\projects\try\Form1.h(161) : error C2146: syntax error : missing ';' before identifier 'Integer'
1>c:\documents and settings\victor palad\my documents\visual studio 2008\projects\try\Form1.h(161) : error C4430: missing type specifier - int assumed. Note: C++ does not support default-int
1>c:\documents and settings\victor palad\my documents\visual studio 2008\projects\try\Form1.h(161) : error C2086: 'int As' : redefinition
1>        c:\documents and settings\victor palad\my documents\visual studio 2008\projects\try\Form1.h(158) : see declaration of 'As'
1>c:\documents and settings\victor palad\my documents\visual studio 2008\projects\try\Form1.h(161) : error C2146: syntax error : missing ';' before identifier 'Private'
1>c:\documents and settings\victor palad\my documents\visual studio 2008\projects\try\Form1.h(161) : error C4430: missing type specifier - int assumed. Note: C++ does not support default-int
1>c:\documents and settings\victor palad\my documents\visual studio 2008\projects\try\Form1.h(161) : error C2086: 'int Integer' : redefinition
1>        c:\documents and settings\victor palad\my documents\visual studio 2008\projects\try\Form1.h(159) : see declaration of 'Integer'
1>c:\documents and settings\victor palad\my documents\visual studio 2008\projects\try\Form1.h(161) : error C2146: syntax error : missing ';' before identifier 'pszLibFileRemote'
1>c:\documents and settings\victor palad\my documents\visual studio 2008\projects\try\Form1.h(161) : error C4430: missing type specifier - int assumed. Note: C++ does not support default-int
1>c:\documents and settings\victor palad\my documents\visual studio 2008\projects\try\Form1.h(161) : error C2086: 'int Private' : redefinition
1>        c:\documents and settings\victor palad\my documents\visual studio 2008\projects\try\Form1.h(158) : see declaration of 'Private'
1>c:\documents and settings\victor palad\my documents\visual studio 2008\projects\try\Form1.h(161) : error C2146: syntax error : missing ';' before identifier 'As'
1>c:\documents and settings\victor palad\my documents\visual studio 2008\projects\try\Form1.h(161) : error C4430: missing type specifier - int assumed. Note: C++ does not support default-int
1>c:\documents and settings\victor palad\my documents\visual studio 2008\projects\try\Form1.h(162) : error C2146: syntax error : missing ';' before identifier 'String'
1>c:\documents and settings\victor palad\my documents\visual studio 2008\projects\try\Form1.h(162) : error C4430: missing type specifier - int assumed. Note: C++ does not support default-int
1>c:\documents and settings\victor palad\my documents\visual studio 2008\projects\try\Form1.h(162) : error C2086: 'int As' : redefinition
1>        c:\documents and settings\victor palad\my documents\visual studio 2008\projects\try\Form1.h(158) : see declaration of 'As'
1>c:\documents and settings\victor palad\my documents\visual studio 2008\projects\try\Form1.h(162) : error C2146: syntax error : missing ';' before identifier 'Private'
1>c:\documents and settings\victor palad\my documents\visual studio 2008\projects\try\Form1.h(162) : error C4430: missing type specifier - int assumed. Note: C++ does not support default-int
1>c:\documents and settings\victor palad\my documents\visual studio 2008\projects\try\Form1.h(162) : error C2146: syntax error : missing ';' before identifier 'TargetBufferSize'
1>c:\documents and settings\victor palad\my documents\visual studio 2008\projects\try\Form1.h(162) : error C4430: missing type specifier - int assumed. Note: C++ does not support default-int
1>c:\documents and settings\victor palad\my documents\visual studio 2008\projects\try\Form1.h(162) : error C2086: 'int Private' : redefinition
1>        c:\documents and settings\victor palad\my documents\visual studio 2008\projects\try\Form1.h(158) : see declaration of 'Private'
1>c:\documents and settings\victor palad\my documents\visual studio 2008\projects\try\Form1.h(162) : error C2146: syntax error : missing ';' before identifier 'As'
1>c:\documents and settings\victor palad\my documents\visual studio 2008\projects\try\Form1.h(162) : error C4430: missing type specifier - int assumed. Note: C++ does not support default-int
1>c:\documents and settings\victor palad\my documents\visual studio 2008\projects\try\Form1.h(164) : error C2146: syntax error : missing ';' before identifier 'Integer'
1>c:\documents and settings\victor palad\my documents\visual studio 2008\projects\try\Form1.h(164) : error C4430: missing type specifier - int assumed. Note: C++ does not support default-int
1>c:\documents and settings\victor palad\my documents\visual studio 2008\projects\try\Form1.h(164) : error C2086: 'int As' : redefinition
1>        c:\documents and settings\victor palad\my documents\visual studio 2008\projects\try\Form1.h(158) : see declaration of 'As'
1>c:\documents and settings\victor palad\my documents\visual studio 2008\projects\try\Form1.h(164) : error C2146: syntax error : missing ';' before identifier 'Public'
1>c:\documents and settings\victor palad\my documents\visual studio 2008\projects\try\Form1.h(164) : error C4430: missing type specifier - int assumed. Note: C++ does not support default-int
1>c:\documents and settings\victor palad\my documents\visual studio 2008\projects\try\Form1.h(164) : error C2086: 'int Integer' : redefinition
1>        c:\documents and settings\victor palad\my documents\visual studio 2008\projects\try\Form1.h(159) : see declaration of 'Integer'
1>c:\documents and settings\victor palad\my documents\visual studio 2008\projects\try\Form1.h(164) : error C2146: syntax error : missing ';' before identifier 'Const'
1>c:\documents and settings\victor palad\my documents\visual studio 2008\projects\try\Form1.h(164) : error C4430: missing type specifier - int assumed. Note: C++ does not support default-int
1>c:\documents and settings\victor palad\my documents\visual studio 2008\projects\try\Form1.h(164) : error C2086: 'int Public' : redefinition
1>        c:\documents and settings\victor palad\my documents\visual studio 2008\projects\try\Form1.h(157) : see declaration of 'Public'
1>c:\documents and settings\victor palad\my documents\visual studio 2008\projects\try\Form1.h(164) : error C2146: syntax error : missing ';' before identifier 'PROCESS_VM_READ'
1>c:\documents and settings\victor palad\my documents\visual studio 2008\projects\try\Form1.h(164) : error C4430: missing type specifier - int assumed. Note: C++ does not support default-int
1>c:\documents and settings\victor palad\my documents\visual studio 2008\projects\try\Form1.h(164) : error C4430: missing type specifier - int assumed. Note: C++ does not support default-int
1>c:\documents and settings\victor palad\my documents\visual studio 2008\projects\try\Form1.h(165) : error C2065: 'H10' : undeclared identifier
1>c:\documents and settings\victor palad\my documents\visual studio 2008\projects\try\Form1.h(165) : error C2146: syntax error : missing ';' before identifier 'Public'
1>c:\documents and settings\victor palad\my documents\visual studio 2008\projects\try\Form1.h(165) : error C2146: syntax error : missing ';' before identifier 'Const'
1>c:\documents and settings\victor palad\my documents\visual studio 2008\projects\try\Form1.h(165) : error C4430: missing type specifier - int assumed. Note: C++ does not support default-int
1>c:\documents and settings\victor palad\my documents\visual studio 2008\projects\try\Form1.h(165) : error C2086: 'int Public' : redefinition
1>        c:\documents and settings\victor palad\my documents\visual studio 2008\projects\try\Form1.h(157) : see declaration of 'Public'
1>c:\documents and settings\victor palad\my documents\visual studio 2008\projects\try\Form1.h(165) : error C2146: syntax error : missing ';' before identifier 'TH32CS_SNAPPROCESS'
1>c:\documents and settings\victor palad\my documents\visual studio 2008\projects\try\Form1.h(165) : error C4430: missing type specifier - int assumed. Note: C++ does not support default-int
1>c:\documents and settings\victor palad\my documents\visual studio 2008\projects\try\Form1.h(165) : error C2086: 'int Const' : redefinition
1>        c:\documents and settings\victor palad\my documents\visual studio 2008\projects\try\Form1.h(164) : see declaration of 'Const'
1>c:\documents and settings\victor palad\my documents\visual studio 2008\projects\try\Form1.h(165) : error C4430: missing type specifier - int assumed. Note: C++ does not support default-int
1>c:\documents and settings\victor palad\my documents\visual studio 2008\projects\try\Form1.h(166) : error C2065: 'H2' : undeclared identifier
1>c:\documents and settings\victor palad\my documents\visual studio 2008\projects\try\Form1.h(166) : error C2146: syntax error : missing ';' before identifier 'Public'
1>c:\documents and settings\victor palad\my documents\visual studio 2008\projects\try\Form1.h(166) : error C2146: syntax error : missing ';' before identifier 'Const'
1>c:\documents and settings\victor palad\my documents\visual studio 2008\projects\try\Form1.h(166) : error C4430: missing type specifier - int assumed. Note: C++ does not support default-int
1>c:\documents and settings\victor palad\my documents\visual studio 2008\projects\try\Form1.h(166) : error C2086: 'int Public' : redefinition
1>        c:\documents and settings\victor palad\my documents\visual studio 2008\projects\try\Form1.h(157) : see declaration of 'Public'
1>c:\documents and settings\victor palad\my documents\visual studio 2008\projects\try\Form1.h(166) : error C2146: syntax error : missing ';' before identifier 'MEM_COMMIT'
1>c:\documents and settings\victor palad\my documents\visual studio 2008\projects\try\Form1.h(166) : error C4430: missing type specifier - int assumed. Note: C++ does not support default-int
1>c:\documents and settings\victor palad\my documents\visual studio 2008\projects\try\Form1.h(166) : error C2086: 'int Const' : redefinition
1>        c:\documents and settings\victor palad\my documents\visual studio 2008\projects\try\Form1.h(164) : see declaration of 'Const'
1>c:\documents and settings\victor palad\my documents\visual studio 2008\projects\try\Form1.h(166) : error C4430: missing type specifier - int assumed. Note: C++ does not support default-int
1>c:\documents and settings\victor palad\my documents\visual studio 2008\projects\try\Form1.h(168) : error C2146: syntax error : missing ';' before identifier 'Public'
1>c:\documents and settings\victor palad\my documents\visual studio 2008\projects\try\Form1.h(168) : error C2146: syntax error : missing ';' before identifier 'Const'
1>c:\documents and settings\victor palad\my documents\visual studio 2008\projects\try\Form1.h(168) : error C4430: missing type specifier - int assumed. Note: C++ does not support default-int
1>c:\documents and settings\victor palad\my documents\visual studio 2008\projects\try\Form1.h(168) : error C2086: 'int Public' : redefinition
1>        c:\documents and settings\victor palad\my documents\visual studio 2008\projects\try\Form1.h(157) : see declaration of 'Public'
1>c:\documents and settings\victor palad\my documents\visual studio 2008\projects\try\Form1.h(168) : error C2146: syntax error : missing ';' before identifier 'PAGE_READWRITE'
1>c:\documents and settings\victor palad\my documents\visual studio 2008\projects\try\Form1.h(168) : error C4430: missing type specifier - int assumed. Note: C++ does not support default-int
1>c:\documents and settings\victor palad\my documents\visual studio 2008\projects\try\Form1.h(168) : error C2086: 'int Const' : redefinition
1>        c:\documents and settings\victor palad\my documents\visual studio 2008\projects\try\Form1.h(164) : see declaration of 'Const'
1>c:\documents and settings\victor palad\my documents\visual studio 2008\projects\try\Form1.h(168) : error C4430: missing type specifier - int assumed. Note: C++ does not support default-int
1>c:\documents and settings\victor palad\my documents\visual studio 2008\projects\try\Form1.h(169) : error C2146: syntax error : missing ';' before identifier 'Public'
1>c:\documents and settings\victor palad\my documents\visual studio 2008\projects\try\Form1.h(169) : error C2146: syntax error : missing ';' before identifier 'Const'
1>c:\documents and settings\victor palad\my documents\visual studio 2008\projects\try\Form1.h(169) : error C4430: missing type specifier - int assumed. Note: C++ does not support default-int
1>c:\documents and settings\victor palad\my documents\visual studio 2008\projects\try\Form1.h(169) : error C2086: 'int Public' : redefinition
1>        c:\documents and settings\victor palad\my documents\visual studio 2008\projects\try\Form1.h(157) : see declaration of 'Public'
1>c:\documents and settings\victor palad\my documents\visual studio 2008\projects\try\Form1.h(169) : error C2146: syntax error : missing ';' before identifier 'PROCESS_CREATE_THREAD'
1>c:\documents and settings\victor palad\my documents\visual studio 2008\projects\try\Form1.h(169) : error C4430: missing type specifier - int assumed. Note: C++ does not support default-int
1>c:\documents and settings\victor palad\my documents\visual studio 2008\projects\try\Form1.h(169) : error C2086: 'int Const' : redefinition
1>        c:\documents and settings\victor palad\my documents\visual studio 2008\projects\try\Form1.h(164) : see declaration of 'Const'
1>c:\documents and settings\victor palad\my documents\visual studio 2008\projects\try\Form1.h(169) : error C4430: missing type specifier - int assumed. Note: C++ does not support default-int
1>c:\documents and settings\victor palad\my documents\visual studio 2008\projects\try\Form1.h(169) : error C2065: 'H2' : undeclared identifier
1>c:\documents and settings\victor palad\my documents\visual studio 2008\projects\try\Form1.h(170) : error C2146: syntax error : missing ';' before identifier 'Public'
1>c:\documents and settings\victor palad\my documents\visual studio 2008\projects\try\Form1.h(170) : error C2146: syntax error : missing ';' before identifier 'Const'
1>c:\documents and settings\victor palad\my documents\visual studio 2008\projects\try\Form1.h(170) : error C4430: missing type specifier - int assumed. Note: C++ does not support default-int
1>c:\documents and settings\victor palad\my documents\visual studio 2008\projects\try\Form1.h(170) : error C2086: 'int Public' : redefinition
1>        c:\documents and settings\victor palad\my documents\visual studio 2008\projects\try\Form1.h(157) : see declaration of 'Public'
1>c:\documents and settings\victor palad\my documents\visual studio 2008\projects\try\Form1.h(170) : error C2146: syntax error : missing ';' before identifier 'PROCESS_VM_OPERATION'
1>c:\documents and settings\victor palad\my documents\visual studio 2008\projects\try\Form1.h(170) : error C4430: missing type specifier - int assumed. Note: C++ does not support default-int
1>c:\documents and settings\victor palad\my documents\visual studio 2008\projects\try\Form1.h(170) : error C2086: 'int Const' : redefinition
1>        c:\documents and settings\victor palad\my documents\visual studio 2008\projects\try\Form1.h(164) : see declaration of 'Const'
1>c:\documents and settings\victor palad\my documents\visual studio 2008\projects\try\Form1.h(170) : error C4430: missing type specifier - int assumed. Note: C++ does not support default-int
1>c:\documents and settings\victor palad\my documents\visual studio 2008\projects\try\Form1.h(170) : error C2065: 'H8' : undeclared identifier
1>c:\documents and settings\victor palad\my documents\visual studio 2008\projects\try\Form1.h(171) : error C2146: syntax error : missing ';' before identifier 'Public'
1>c:\documents and settings\victor palad\my documents\visual studio 2008\projects\try\Form1.h(171) : error C2146: syntax error : missing ';' before identifier 'Const'
1>c:\documents and settings\victor palad\my documents\visual studio 2008\projects\try\Form1.h(171) : error C4430: missing type specifier - int assumed. Note: C++ does not support default-int
1>c:\documents and settings\victor palad\my documents\visual studio 2008\projects\try\Form1.h(171) : error C2086: 'int Public' : redefinition
1>        c:\documents and settings\victor palad\my documents\visual studio 2008\projects\try\Form1.h(157) : see declaration of 'Public'
1>c:\documents and settings\victor palad\my documents\visual studio 2008\projects\try\Form1.h(171) : error C2146: syntax error : missing ';' before identifier 'PROCESS_VM_WRITE'
1>c:\documents and settings\victor palad\my documents\visual studio 2008\projects\try\Form1.h(171) : error C4430: missing type specifier - int assumed. Note: C++ does not support default-int
1>c:\documents and settings\victor palad\my documents\visual studio 2008\projects\try\Form1.h(171) : error C2086: 'int Const' : redefinition
1>        c:\documents and settings\victor palad\my documents\visual studio 2008\projects\try\Form1.h(164) : see declaration of 'Const'
1>c:\documents and settings\victor palad\my documents\visual studio 2008\projects\try\Form1.h(171) : error C4430: missing type specifier - int assumed. Note: C++ does not support default-int
1>c:\documents and settings\victor palad\my documents\visual studio 2008\projects\try\Form1.h(171) : error C2065: 'H20' : undeclared identifier
1>c:\documents and settings\victor palad\my documents\visual studio 2008\projects\try\Form1.h(172) : error C2146: syntax error : missing ';' before identifier 'Dim'
1>c:\documents and settings\victor palad\my documents\visual studio 2008\projects\try\Form1.h(172) : error C2146: syntax error : missing ';' before identifier 'DLLFileName'
1>c:\documents and settings\victor palad\my documents\visual studio 2008\projects\try\Form1.h(172) : error C4430: missing type specifier - int assumed. Note: C++ does not support default-int
1>c:\documents and settings\victor palad\my documents\visual studio 2008\projects\try\Form1.h(172) : error C2146: syntax error : missing ';' before identifier 'As'
1>c:\documents and settings\victor palad\my documents\visual studio 2008\projects\try\Form1.h(172) : error C4430: missing type specifier - int assumed. Note: C++ does not support default-int
1>c:\documents and settings\victor palad\my documents\visual studio 2008\projects\try\Form1.h(173) : error C2146: syntax error : missing ';' before identifier 'String'
1>c:\documents and settings\victor palad\my documents\visual studio 2008\projects\try\Form1.h(173) : error C4430: missing type specifier - int assumed. Note: C++ does not support default-int
1>c:\documents and settings\victor palad\my documents\visual studio 2008\projects\try\Form1.h(173) : error C2086: 'int As' : redefinition
1>        c:\documents and settings\victor palad\my documents\visual studio 2008\projects\try\Form1.h(158) : see declaration of 'As'
1>c:\documents and settings\victor palad\my documents\visual studio 2008\projects\try\Form1.h(173) : error C2146: syntax error : missing ';' before identifier 'Public'
1>c:\documents and settings\victor palad\my documents\visual studio 2008\projects\try\Form1.h(173) : error C4430: missing type specifier - int assumed. Note: C++ does not support default-int
1>c:\documents and settings\victor palad\my documents\visual studio 2008\projects\try\Form1.h(173) : error C2086: 'int String' : redefinition
1>        c:\documents and settings\victor palad\my documents\visual studio 2008\projects\try\Form1.h(162) : see declaration of 'String'
1>c:\documents and settings\victor palad\my documents\visual studio 2008\projects\try\Form1.h(173) : error C2146: syntax error : missing ';' before identifier 'Declare'
1>c:\documents and settings\victor palad\my documents\visual studio 2008\projects\try\Form1.h(173) : error C4430: missing type specifier - int assumed. Note: C++ does not support default-int
1>c:\documents and settings\victor palad\my documents\visual studio 2008\projects\try\Form1.h(173) : error C2086: 'int Public' : redefinition
1>        c:\documents and settings\victor palad\my documents\visual studio 2008\projects\try\Form1.h(157) : see declaration of 'Public'
1>c:\documents and settings\victor palad\my documents\visual studio 2008\projects\try\Form1.h(173) : error C2146: syntax error : missing ';' before identifier 'Function'
1>c:\documents and settings\victor palad\my documents\visual studio 2008\projects\try\Form1.h(173) : error C4430: missing type specifier - int assumed. Note: C++ does not support default-int
1>c:\documents and settings\victor palad\my documents\visual studio 2008\projects\try\Form1.h(173) : error C2146: syntax error : missing ';' before identifier 'ReadProcessMemory'
1>c:\documents and settings\victor palad\my documents\visual studio 2008\projects\try\Form1.h(173) : error C4430: missing type specifier - int assumed. Note: C++ does not support default-int
1>c:\documents and settings\victor palad\my documents\visual studio 2008\projects\try\Form1.h(173) : error C2146: syntax error : missing ';' before identifier 'Lib'
1>c:\documents and settings\victor palad\my documents\visual studio 2008\projects\try\Form1.h(173) : error C4430: missing type specifier - int assumed. Note: C++ does not support default-int
1>c:\documents and settings\victor palad\my documents\visual studio 2008\projects\try\Form1.h(173) : error C2143: syntax error : missing ';' before 'string'
1>c:\documents and settings\victor palad\my documents\visual studio 2008\projects\try\Form1.h(173) : error C4430: missing type specifier - int assumed. Note: C++ does not support default-int
1>c:\documents and settings\victor palad\my documents\visual studio 2008\projects\try\Form1.h(228) : error C2001: newline in constant
1>c:\documents and settings\victor palad\my documents\visual studio 2008\projects\try\Form1.h(228) : error C2015: too many characters in constant
1>c:\documents and settings\victor palad\my documents\visual studio 2008\projects\try\Form1.h(241) : error C2143: syntax error : missing ';' before '.'
1>c:\documents and settings\victor palad\my documents\visual studio 2008\projects\try\Form1.h(241) : error C4430: missing type specifier - int assumed. Note: C++ does not support default-int
1>c:\documents and settings\victor palad\my documents\visual studio 2008\projects\try\Form1.h(271) : error C2001: newline in constant
1>c:\documents and settings\victor palad\my documents\visual studio 2008\projects\try\Form1.h(272) : error C2001: newline in constant
1>.\Try.cpp(6) : error C2143: syntax error : missing ')' before ';'
1>.\Try.cpp(6) : error C2143: syntax error : missing ')' before ';'
1>.\Try.cpp(6) : error C2143: syntax error : missing ')' before ';'
1>.\Try.cpp(8) : error C2337: 'STAThreadAttribute' : attribute not found
1>.\Try.cpp(12) : error C2653: 'Application' : is not a class or namespace name
1>.\Try.cpp(12) : error C3861: 'EnableVisualStyles': identifier not found
1>.\Try.cpp(13) : error C2653: 'Application' : is not a class or namespace name
1>.\Try.cpp(13) : error C3861: 'SetCompatibleTextRenderingDefault': identifier not found
1>.\Try.cpp(16) : error C2653: 'Application' : is not a class or namespace name
1>.\Try.cpp(16) : error C2061: syntax error : identifier 'Form1'
1>.\Try.cpp(16) : error C3861: 'Run': identifier not found
1>Generating Code...
1>Build log was saved at "file://c:\Documents and Settings\Victor Palad\My Documents\Visual Studio 2008\Projects\Try\Debug\BuildLog.htm"
1>Try - 144 error(s), 0 warning(s)
========== Build: 0 succeeded, 1 failed, 0 up-to-date, 0 skipped ==========
Please Help !
Quote Originally Posted by mcbone14 View Post
And have a Problem in My VB2008 .every code that i see has Errors if i Erase the First Code When i Doubled Click On It T.T

---------- Post added at 09:36 AM ---------- Previous post was at 09:04 AM ----------

Here is the F*CK*NG Code i've Got When i Double Click The Form T.T
Code:
#pragma once


namespace Try {

	using namespace System;
	using namespace System::ComponentModel;
	using namespace System::Collections;
	using namespace System::Windows::Forms;
	using namespace System::Data;
	using namespace System::Drawing;

	/// <summary>
	/// Summary for Form1
	///
	/// WARNING: If you change the name of this class, you will need to change the
	///          'Resource File Name' property for the managed resource compiler tool
	///          associated with all .resx files this class depends on.  Otherwise,
	///          the designers will not be able to interact properly with localized
	///          resources associated with this form.
	/// </summary>
	public ref class Form1 : public System::Windows::Forms::Form
	{
	public:
		Form1(void)
		{
			InitializeComponent();
			//
			//TODO: Add the constructor code here
			//
		}

	protected:
		/// <summary>
		/// Clean up any resources being used.
		/// </summary>
		~Form1()
		{
			if (components)
			{
				delete components;
			}
		}
	private: System::Windows::Forms::Button^  button1;
	protected: 
	private: System::Windows::Forms::Label^  label1;
	private: System::Windows::Forms::Label^  label2;
	private: System::Windows::Forms::Label^  label3;
	private: System::Windows::Forms::TextBox^  textBox1;
	private: System::Windows::Forms::TextBox^  textBox2;
	private: System::Windows::Forms::Timer^  timer1;
	private: System::Windows::Forms::OpenFileDialog^  openFileDialog1;
	private: System::ComponentModel::IContainer^  components;

	private:
		/// <summary>
		/// Required designer variable.
		/// </summary>


#pragma region Windows Form Designer generated code
		/// <summary>
		/// Required method for Designer support - do not modify
		/// the contents of this method with the code editor.
		/// </summary>
		void InitializeComponent(void)
		{
			this->components = (gcnew System::ComponentModel::Container());
			this->button1 = (gcnew System::Windows::Forms::Button());
			this->label1 = (gcnew System::Windows::Forms::Label());
			this->label2 = (gcnew System::Windows::Forms::Label());
			this->label3 = (gcnew System::Windows::Forms::Label());
			this->textBox1 = (gcnew System::Windows::Forms::TextBox());
			this->textBox2 = (gcnew System::Windows::Forms::TextBox());
			this->timer1 = (gcnew System::Windows::Forms::Timer(this->components));
			this->openFileDialog1 = (gcnew System::Windows::Forms::OpenFileDialog());
			this->SuspendLayout();
			// 
			// button1
			// 
			this->button1->Location = System::Drawing::Point(85, 137);
			this->button1->Name = L"button1";
			this->button1->Size = System::Drawing::Size(114, 35);
			this->button1->TabIndex = 0;
			this->button1->Text = L"Browse";
			this->button1->UseVisualStyleBackColor = true;
			// 
			// label1
			// 
			this->label1->AutoSize = true;
			this->label1->Location = System::Drawing::Point(9, 244);
			this->label1->Name = L"label1";
			this->label1->Size = System::Drawing::Size(35, 13);
			this->label1->TabIndex = 1;
			this->label1->Text = L"label1";
			// 
			// label2
			// 
			this->label2->AutoSize = true;
			this->label2->Location = System::Drawing::Point(10, 19);
			this->label2->Name = L"label2";
			this->label2->Size = System::Drawing::Size(79, 13);
			this->label2->TabIndex = 2;
			this->label2->Text = L"Process Name:";
			// 
			// label3
			// 
			this->label3->AutoSize = true;
			this->label3->Location = System::Drawing::Point(12, 74);
			this->label3->Name = L"label3";
			this->label3->Size = System::Drawing::Size(67, 13);
			this->label3->TabIndex = 3;
			this->label3->Text = L"Dll To Inject:";
			// 
			// textBox1
			// 
			this->textBox1->Location = System::Drawing::Point(13, 41);
			this->textBox1->Name = L"textBox1";
			this->textBox1->Size = System::Drawing::Size(268, 20);
			this->textBox1->TabIndex = 4;
			// 
			// textBox2
			// 
			this->textBox2->Location = System::Drawing::Point(17, 104);
			this->textBox2->Name = L"textBox2";
			this->textBox2->Size = System::Drawing::Size(263, 20);
			this->textBox2->TabIndex = 5;
			// 
			// openFileDialog1
			// 
			this->openFileDialog1->FileName = L"openFileDialog1";
			// 
			// Form1
			// 
			this->AutoScaleDimensions = System::Drawing::SizeF(6, 13);
			this->AutoScaleMode = System::Windows::Forms::AutoScaleMode::Font;
			this->ClientSize = System::Drawing::Size(292, 273);
			this->Controls->Add(this->textBox2);
			this->Controls->Add(this->textBox1);
			this->Controls->Add(this->label3);
			this->Controls->Add(this->label2);
			this->Controls->Add(this->label1);
			this->Controls->Add(this->button1);
			this->Name = L"Form1";
			this->Text = L"Injector";
			this->Load += gcnew System::EventHandler(this, &Form1::Form1_Load);
			this->ResumeLayout(false);
			this->PerformLayout();

		}
#pragma endregion
	private: System::Void Form1_Load(System::Object^  sender, System::EventArgs^  e) {
			 }
};
}
Anyone Help Me?

But When i Delete Those Code Get This.


But When I don't Delete Those Codes and Paste Yours.
I Get These Errors:

Code:
1>------ Build started: Project: Try, Configuration: Debug Win32 ------
1>Compiling...
1>stdafx.cpp
1>Compiling...
1>AssemblyInfo.cpp
1>Try.cpp
1>c:\documents and settings\victor palad\my documents\visual studio 2008\projects\try\Form1.h(157) : error C2146: syntax error : missing ';' before identifier 'Class'
1>c:\documents and settings\victor palad\my documents\visual studio 2008\projects\try\Form1.h(157) : error C4430: missing type specifier - int assumed. Note: C++ does not support default-int
1>c:\documents and settings\victor palad\my documents\visual studio 2008\projects\try\Form1.h(158) : error C2146: syntax error : missing ';' before identifier 'Form1'
1>c:\documents and settings\victor palad\my documents\visual studio 2008\projects\try\Form1.h(158) : error C4430: missing type specifier - int assumed. Note: C++ does not support default-int
1>c:\documents and settings\victor palad\my documents\visual studio 2008\projects\try\Form1.h(158) : error C2146: syntax error : missing ';' before identifier 'Private'
1>c:\documents and settings\victor palad\my documents\visual studio 2008\projects\try\Form1.h(158) : error C4430: missing type specifier - int assumed. Note: C++ does not support default-int
1>c:\documents and settings\victor palad\my documents\visual studio 2008\projects\try\Form1.h(158) : error C2146: syntax error : missing ';' before identifier 'TargetProcessHandle'
1>c:\documents and settings\victor palad\my documents\visual studio 2008\projects\try\Form1.h(158) : error C4430: missing type specifier - int assumed. Note: C++ does not support default-int
1>c:\documents and settings\victor palad\my documents\visual studio 2008\projects\try\Form1.h(158) : error C2146: syntax error : missing ';' before identifier 'As'
1>c:\documents and settings\victor palad\my documents\visual studio 2008\projects\try\Form1.h(158) : error C4430: missing type specifier - int assumed. Note: C++ does not support default-int
1>c:\documents and settings\victor palad\my documents\visual studio 2008\projects\try\Form1.h(159) : error C2146: syntax error : missing ';' before identifier 'Integer'
1>c:\documents and settings\victor palad\my documents\visual studio 2008\projects\try\Form1.h(159) : error C4430: missing type specifier - int assumed. Note: C++ does not support default-int
1>c:\documents and settings\victor palad\my documents\visual studio 2008\projects\try\Form1.h(159) : error C2146: syntax error : missing ';' before identifier 'Private'
1>c:\documents and settings\victor palad\my documents\visual studio 2008\projects\try\Form1.h(159) : error C4430: missing type specifier - int assumed. Note: C++ does not support default-int
1>c:\documents and settings\victor palad\my documents\visual studio 2008\projects\try\Form1.h(159) : error C2146: syntax error : missing ';' before identifier 'pfnStartAddr'
1>c:\documents and settings\victor palad\my documents\visual studio 2008\projects\try\Form1.h(159) : error C4430: missing type specifier - int assumed. Note: C++ does not support default-int
1>c:\documents and settings\victor palad\my documents\visual studio 2008\projects\try\Form1.h(159) : error C2086: 'int Private' : redefinition
1>        c:\documents and settings\victor palad\my documents\visual studio 2008\projects\try\Form1.h(158) : see declaration of 'Private'
1>c:\documents and settings\victor palad\my documents\visual studio 2008\projects\try\Form1.h(159) : error C2146: syntax error : missing ';' before identifier 'As'
1>c:\documents and settings\victor palad\my documents\visual studio 2008\projects\try\Form1.h(159) : error C4430: missing type specifier - int assumed. Note: C++ does not support default-int
1>c:\documents and settings\victor palad\my documents\visual studio 2008\projects\try\Form1.h(161) : error C2146: syntax error : missing ';' before identifier 'Integer'
1>c:\documents and settings\victor palad\my documents\visual studio 2008\projects\try\Form1.h(161) : error C4430: missing type specifier - int assumed. Note: C++ does not support default-int
1>c:\documents and settings\victor palad\my documents\visual studio 2008\projects\try\Form1.h(161) : error C2086: 'int As' : redefinition
1>        c:\documents and settings\victor palad\my documents\visual studio 2008\projects\try\Form1.h(158) : see declaration of 'As'
1>c:\documents and settings\victor palad\my documents\visual studio 2008\projects\try\Form1.h(161) : error C2146: syntax error : missing ';' before identifier 'Private'
1>c:\documents and settings\victor palad\my documents\visual studio 2008\projects\try\Form1.h(161) : error C4430: missing type specifier - int assumed. Note: C++ does not support default-int
1>c:\documents and settings\victor palad\my documents\visual studio 2008\projects\try\Form1.h(161) : error C2086: 'int Integer' : redefinition
1>        c:\documents and settings\victor palad\my documents\visual studio 2008\projects\try\Form1.h(159) : see declaration of 'Integer'
1>c:\documents and settings\victor palad\my documents\visual studio 2008\projects\try\Form1.h(161) : error C2146: syntax error : missing ';' before identifier 'pszLibFileRemote'
1>c:\documents and settings\victor palad\my documents\visual studio 2008\projects\try\Form1.h(161) : error C4430: missing type specifier - int assumed. Note: C++ does not support default-int
1>c:\documents and settings\victor palad\my documents\visual studio 2008\projects\try\Form1.h(161) : error C2086: 'int Private' : redefinition
1>        c:\documents and settings\victor palad\my documents\visual studio 2008\projects\try\Form1.h(158) : see declaration of 'Private'
1>c:\documents and settings\victor palad\my documents\visual studio 2008\projects\try\Form1.h(161) : error C2146: syntax error : missing ';' before identifier 'As'
1>c:\documents and settings\victor palad\my documents\visual studio 2008\projects\try\Form1.h(161) : error C4430: missing type specifier - int assumed. Note: C++ does not support default-int
1>c:\documents and settings\victor palad\my documents\visual studio 2008\projects\try\Form1.h(162) : error C2146: syntax error : missing ';' before identifier 'String'
1>c:\documents and settings\victor palad\my documents\visual studio 2008\projects\try\Form1.h(162) : error C4430: missing type specifier - int assumed. Note: C++ does not support default-int
1>c:\documents and settings\victor palad\my documents\visual studio 2008\projects\try\Form1.h(162) : error C2086: 'int As' : redefinition
1>        c:\documents and settings\victor palad\my documents\visual studio 2008\projects\try\Form1.h(158) : see declaration of 'As'
1>c:\documents and settings\victor palad\my documents\visual studio 2008\projects\try\Form1.h(162) : error C2146: syntax error : missing ';' before identifier 'Private'
1>c:\documents and settings\victor palad\my documents\visual studio 2008\projects\try\Form1.h(162) : error C4430: missing type specifier - int assumed. Note: C++ does not support default-int
1>c:\documents and settings\victor palad\my documents\visual studio 2008\projects\try\Form1.h(162) : error C2146: syntax error : missing ';' before identifier 'TargetBufferSize'
1>c:\documents and settings\victor palad\my documents\visual studio 2008\projects\try\Form1.h(162) : error C4430: missing type specifier - int assumed. Note: C++ does not support default-int
1>c:\documents and settings\victor palad\my documents\visual studio 2008\projects\try\Form1.h(162) : error C2086: 'int Private' : redefinition
1>        c:\documents and settings\victor palad\my documents\visual studio 2008\projects\try\Form1.h(158) : see declaration of 'Private'
1>c:\documents and settings\victor palad\my documents\visual studio 2008\projects\try\Form1.h(162) : error C2146: syntax error : missing ';' before identifier 'As'
1>c:\documents and settings\victor palad\my documents\visual studio 2008\projects\try\Form1.h(162) : error C4430: missing type specifier - int assumed. Note: C++ does not support default-int
1>c:\documents and settings\victor palad\my documents\visual studio 2008\projects\try\Form1.h(164) : error C2146: syntax error : missing ';' before identifier 'Integer'
1>c:\documents and settings\victor palad\my documents\visual studio 2008\projects\try\Form1.h(164) : error C4430: missing type specifier - int assumed. Note: C++ does not support default-int
1>c:\documents and settings\victor palad\my documents\visual studio 2008\projects\try\Form1.h(164) : error C2086: 'int As' : redefinition
1>        c:\documents and settings\victor palad\my documents\visual studio 2008\projects\try\Form1.h(158) : see declaration of 'As'
1>c:\documents and settings\victor palad\my documents\visual studio 2008\projects\try\Form1.h(164) : error C2146: syntax error : missing ';' before identifier 'Public'
1>c:\documents and settings\victor palad\my documents\visual studio 2008\projects\try\Form1.h(164) : error C4430: missing type specifier - int assumed. Note: C++ does not support default-int
1>c:\documents and settings\victor palad\my documents\visual studio 2008\projects\try\Form1.h(164) : error C2086: 'int Integer' : redefinition
1>        c:\documents and settings\victor palad\my documents\visual studio 2008\projects\try\Form1.h(159) : see declaration of 'Integer'
1>c:\documents and settings\victor palad\my documents\visual studio 2008\projects\try\Form1.h(164) : error C2146: syntax error : missing ';' before identifier 'Const'
1>c:\documents and settings\victor palad\my documents\visual studio 2008\projects\try\Form1.h(164) : error C4430: missing type specifier - int assumed. Note: C++ does not support default-int
1>c:\documents and settings\victor palad\my documents\visual studio 2008\projects\try\Form1.h(164) : error C2086: 'int Public' : redefinition
1>        c:\documents and settings\victor palad\my documents\visual studio 2008\projects\try\Form1.h(157) : see declaration of 'Public'
1>c:\documents and settings\victor palad\my documents\visual studio 2008\projects\try\Form1.h(164) : error C2146: syntax error : missing ';' before identifier 'PROCESS_VM_READ'
1>c:\documents and settings\victor palad\my documents\visual studio 2008\projects\try\Form1.h(164) : error C4430: missing type specifier - int assumed. Note: C++ does not support default-int
1>c:\documents and settings\victor palad\my documents\visual studio 2008\projects\try\Form1.h(164) : error C4430: missing type specifier - int assumed. Note: C++ does not support default-int
1>c:\documents and settings\victor palad\my documents\visual studio 2008\projects\try\Form1.h(165) : error C2065: 'H10' : undeclared identifier
1>c:\documents and settings\victor palad\my documents\visual studio 2008\projects\try\Form1.h(165) : error C2146: syntax error : missing ';' before identifier 'Public'
1>c:\documents and settings\victor palad\my documents\visual studio 2008\projects\try\Form1.h(165) : error C2146: syntax error : missing ';' before identifier 'Const'
1>c:\documents and settings\victor palad\my documents\visual studio 2008\projects\try\Form1.h(165) : error C4430: missing type specifier - int assumed. Note: C++ does not support default-int
1>c:\documents and settings\victor palad\my documents\visual studio 2008\projects\try\Form1.h(165) : error C2086: 'int Public' : redefinition
1>        c:\documents and settings\victor palad\my documents\visual studio 2008\projects\try\Form1.h(157) : see declaration of 'Public'
1>c:\documents and settings\victor palad\my documents\visual studio 2008\projects\try\Form1.h(165) : error C2146: syntax error : missing ';' before identifier 'TH32CS_SNAPPROCESS'
1>c:\documents and settings\victor palad\my documents\visual studio 2008\projects\try\Form1.h(165) : error C4430: missing type specifier - int assumed. Note: C++ does not support default-int
1>c:\documents and settings\victor palad\my documents\visual studio 2008\projects\try\Form1.h(165) : error C2086: 'int Const' : redefinition
1>        c:\documents and settings\victor palad\my documents\visual studio 2008\projects\try\Form1.h(164) : see declaration of 'Const'
1>c:\documents and settings\victor palad\my documents\visual studio 2008\projects\try\Form1.h(165) : error C4430: missing type specifier - int assumed. Note: C++ does not support default-int
1>c:\documents and settings\victor palad\my documents\visual studio 2008\projects\try\Form1.h(166) : error C2065: 'H2' : undeclared identifier
1>c:\documents and settings\victor palad\my documents\visual studio 2008\projects\try\Form1.h(166) : error C2146: syntax error : missing ';' before identifier 'Public'
1>c:\documents and settings\victor palad\my documents\visual studio 2008\projects\try\Form1.h(166) : error C2146: syntax error : missing ';' before identifier 'Const'
1>c:\documents and settings\victor palad\my documents\visual studio 2008\projects\try\Form1.h(166) : error C4430: missing type specifier - int assumed. Note: C++ does not support default-int
1>c:\documents and settings\victor palad\my documents\visual studio 2008\projects\try\Form1.h(166) : error C2086: 'int Public' : redefinition
1>        c:\documents and settings\victor palad\my documents\visual studio 2008\projects\try\Form1.h(157) : see declaration of 'Public'
1>c:\documents and settings\victor palad\my documents\visual studio 2008\projects\try\Form1.h(166) : error C2146: syntax error : missing ';' before identifier 'MEM_COMMIT'
1>c:\documents and settings\victor palad\my documents\visual studio 2008\projects\try\Form1.h(166) : error C4430: missing type specifier - int assumed. Note: C++ does not support default-int
1>c:\documents and settings\victor palad\my documents\visual studio 2008\projects\try\Form1.h(166) : error C2086: 'int Const' : redefinition
1>        c:\documents and settings\victor palad\my documents\visual studio 2008\projects\try\Form1.h(164) : see declaration of 'Const'
1>c:\documents and settings\victor palad\my documents\visual studio 2008\projects\try\Form1.h(166) : error C4430: missing type specifier - int assumed. Note: C++ does not support default-int
1>c:\documents and settings\victor palad\my documents\visual studio 2008\projects\try\Form1.h(168) : error C2146: syntax error : missing ';' before identifier 'Public'
1>c:\documents and settings\victor palad\my documents\visual studio 2008\projects\try\Form1.h(168) : error C2146: syntax error : missing ';' before identifier 'Const'
1>c:\documents and settings\victor palad\my documents\visual studio 2008\projects\try\Form1.h(168) : error C4430: missing type specifier - int assumed. Note: C++ does not support default-int
1>c:\documents and settings\victor palad\my documents\visual studio 2008\projects\try\Form1.h(168) : error C2086: 'int Public' : redefinition
1>        c:\documents and settings\victor palad\my documents\visual studio 2008\projects\try\Form1.h(157) : see declaration of 'Public'
1>c:\documents and settings\victor palad\my documents\visual studio 2008\projects\try\Form1.h(168) : error C2146: syntax error : missing ';' before identifier 'PAGE_READWRITE'
1>c:\documents and settings\victor palad\my documents\visual studio 2008\projects\try\Form1.h(168) : error C4430: missing type specifier - int assumed. Note: C++ does not support default-int
1>c:\documents and settings\victor palad\my documents\visual studio 2008\projects\try\Form1.h(168) : error C2086: 'int Const' : redefinition
1>        c:\documents and settings\victor palad\my documents\visual studio 2008\projects\try\Form1.h(164) : see declaration of 'Const'
1>c:\documents and settings\victor palad\my documents\visual studio 2008\projects\try\Form1.h(168) : error C4430: missing type specifier - int assumed. Note: C++ does not support default-int
1>c:\documents and settings\victor palad\my documents\visual studio 2008\projects\try\Form1.h(169) : error C2146: syntax error : missing ';' before identifier 'Public'
1>c:\documents and settings\victor palad\my documents\visual studio 2008\projects\try\Form1.h(169) : error C2146: syntax error : missing ';' before identifier 'Const'
1>c:\documents and settings\victor palad\my documents\visual studio 2008\projects\try\Form1.h(169) : error C4430: missing type specifier - int assumed. Note: C++ does not support default-int
1>c:\documents and settings\victor palad\my documents\visual studio 2008\projects\try\Form1.h(169) : error C2086: 'int Public' : redefinition
1>        c:\documents and settings\victor palad\my documents\visual studio 2008\projects\try\Form1.h(157) : see declaration of 'Public'
1>c:\documents and settings\victor palad\my documents\visual studio 2008\projects\try\Form1.h(169) : error C2146: syntax error : missing ';' before identifier 'PROCESS_CREATE_THREAD'
1>c:\documents and settings\victor palad\my documents\visual studio 2008\projects\try\Form1.h(169) : error C4430: missing type specifier - int assumed. Note: C++ does not support default-int
1>c:\documents and settings\victor palad\my documents\visual studio 2008\projects\try\Form1.h(169) : error C2086: 'int Const' : redefinition
1>        c:\documents and settings\victor palad\my documents\visual studio 2008\projects\try\Form1.h(164) : see declaration of 'Const'
1>c:\documents and settings\victor palad\my documents\visual studio 2008\projects\try\Form1.h(169) : error C4430: missing type specifier - int assumed. Note: C++ does not support default-int
1>c:\documents and settings\victor palad\my documents\visual studio 2008\projects\try\Form1.h(169) : error C2065: 'H2' : undeclared identifier
1>c:\documents and settings\victor palad\my documents\visual studio 2008\projects\try\Form1.h(170) : error C2146: syntax error : missing ';' before identifier 'Public'
1>c:\documents and settings\victor palad\my documents\visual studio 2008\projects\try\Form1.h(170) : error C2146: syntax error : missing ';' before identifier 'Const'
1>c:\documents and settings\victor palad\my documents\visual studio 2008\projects\try\Form1.h(170) : error C4430: missing type specifier - int assumed. Note: C++ does not support default-int
1>c:\documents and settings\victor palad\my documents\visual studio 2008\projects\try\Form1.h(170) : error C2086: 'int Public' : redefinition
1>        c:\documents and settings\victor palad\my documents\visual studio 2008\projects\try\Form1.h(157) : see declaration of 'Public'
1>c:\documents and settings\victor palad\my documents\visual studio 2008\projects\try\Form1.h(170) : error C2146: syntax error : missing ';' before identifier 'PROCESS_VM_OPERATION'
1>c:\documents and settings\victor palad\my documents\visual studio 2008\projects\try\Form1.h(170) : error C4430: missing type specifier - int assumed. Note: C++ does not support default-int
1>c:\documents and settings\victor palad\my documents\visual studio 2008\projects\try\Form1.h(170) : error C2086: 'int Const' : redefinition
1>        c:\documents and settings\victor palad\my documents\visual studio 2008\projects\try\Form1.h(164) : see declaration of 'Const'
1>c:\documents and settings\victor palad\my documents\visual studio 2008\projects\try\Form1.h(170) : error C4430: missing type specifier - int assumed. Note: C++ does not support default-int
1>c:\documents and settings\victor palad\my documents\visual studio 2008\projects\try\Form1.h(170) : error C2065: 'H8' : undeclared identifier
1>c:\documents and settings\victor palad\my documents\visual studio 2008\projects\try\Form1.h(171) : error C2146: syntax error : missing ';' before identifier 'Public'
1>c:\documents and settings\victor palad\my documents\visual studio 2008\projects\try\Form1.h(171) : error C2146: syntax error : missing ';' before identifier 'Const'
1>c:\documents and settings\victor palad\my documents\visual studio 2008\projects\try\Form1.h(171) : error C4430: missing type specifier - int assumed. Note: C++ does not support default-int
1>c:\documents and settings\victor palad\my documents\visual studio 2008\projects\try\Form1.h(171) : error C2086: 'int Public' : redefinition
1>        c:\documents and settings\victor palad\my documents\visual studio 2008\projects\try\Form1.h(157) : see declaration of 'Public'
1>c:\documents and settings\victor palad\my documents\visual studio 2008\projects\try\Form1.h(171) : error C2146: syntax error : missing ';' before identifier 'PROCESS_VM_WRITE'
1>c:\documents and settings\victor palad\my documents\visual studio 2008\projects\try\Form1.h(171) : error C4430: missing type specifier - int assumed. Note: C++ does not support default-int
1>c:\documents and settings\victor palad\my documents\visual studio 2008\projects\try\Form1.h(171) : error C2086: 'int Const' : redefinition
1>        c:\documents and settings\victor palad\my documents\visual studio 2008\projects\try\Form1.h(164) : see declaration of 'Const'
1>c:\documents and settings\victor palad\my documents\visual studio 2008\projects\try\Form1.h(171) : error C4430: missing type specifier - int assumed. Note: C++ does not support default-int
1>c:\documents and settings\victor palad\my documents\visual studio 2008\projects\try\Form1.h(171) : error C2065: 'H20' : undeclared identifier
1>c:\documents and settings\victor palad\my documents\visual studio 2008\projects\try\Form1.h(172) : error C2146: syntax error : missing ';' before identifier 'Dim'
1>c:\documents and settings\victor palad\my documents\visual studio 2008\projects\try\Form1.h(172) : error C2146: syntax error : missing ';' before identifier 'DLLFileName'
1>c:\documents and settings\victor palad\my documents\visual studio 2008\projects\try\Form1.h(172) : error C4430: missing type specifier - int assumed. Note: C++ does not support default-int
1>c:\documents and settings\victor palad\my documents\visual studio 2008\projects\try\Form1.h(172) : error C2146: syntax error : missing ';' before identifier 'As'
1>c:\documents and settings\victor palad\my documents\visual studio 2008\projects\try\Form1.h(172) : error C4430: missing type specifier - int assumed. Note: C++ does not support default-int
1>c:\documents and settings\victor palad\my documents\visual studio 2008\projects\try\Form1.h(173) : error C2146: syntax error : missing ';' before identifier 'String'
1>c:\documents and settings\victor palad\my documents\visual studio 2008\projects\try\Form1.h(173) : error C4430: missing type specifier - int assumed. Note: C++ does not support default-int
1>c:\documents and settings\victor palad\my documents\visual studio 2008\projects\try\Form1.h(173) : error C2086: 'int As' : redefinition
1>        c:\documents and settings\victor palad\my documents\visual studio 2008\projects\try\Form1.h(158) : see declaration of 'As'
1>c:\documents and settings\victor palad\my documents\visual studio 2008\projects\try\Form1.h(173) : error C2146: syntax error : missing ';' before identifier 'Public'
1>c:\documents and settings\victor palad\my documents\visual studio 2008\projects\try\Form1.h(173) : error C4430: missing type specifier - int assumed. Note: C++ does not support default-int
1>c:\documents and settings\victor palad\my documents\visual studio 2008\projects\try\Form1.h(173) : error C2086: 'int String' : redefinition
1>        c:\documents and settings\victor palad\my documents\visual studio 2008\projects\try\Form1.h(162) : see declaration of 'String'
1>c:\documents and settings\victor palad\my documents\visual studio 2008\projects\try\Form1.h(173) : error C2146: syntax error : missing ';' before identifier 'Declare'
1>c:\documents and settings\victor palad\my documents\visual studio 2008\projects\try\Form1.h(173) : error C4430: missing type specifier - int assumed. Note: C++ does not support default-int
1>c:\documents and settings\victor palad\my documents\visual studio 2008\projects\try\Form1.h(173) : error C2086: 'int Public' : redefinition
1>        c:\documents and settings\victor palad\my documents\visual studio 2008\projects\try\Form1.h(157) : see declaration of 'Public'
1>c:\documents and settings\victor palad\my documents\visual studio 2008\projects\try\Form1.h(173) : error C2146: syntax error : missing ';' before identifier 'Function'
1>c:\documents and settings\victor palad\my documents\visual studio 2008\projects\try\Form1.h(173) : error C4430: missing type specifier - int assumed. Note: C++ does not support default-int
1>c:\documents and settings\victor palad\my documents\visual studio 2008\projects\try\Form1.h(173) : error C2146: syntax error : missing ';' before identifier 'ReadProcessMemory'
1>c:\documents and settings\victor palad\my documents\visual studio 2008\projects\try\Form1.h(173) : error C4430: missing type specifier - int assumed. Note: C++ does not support default-int
1>c:\documents and settings\victor palad\my documents\visual studio 2008\projects\try\Form1.h(173) : error C2146: syntax error : missing ';' before identifier 'Lib'
1>c:\documents and settings\victor palad\my documents\visual studio 2008\projects\try\Form1.h(173) : error C4430: missing type specifier - int assumed. Note: C++ does not support default-int
1>c:\documents and settings\victor palad\my documents\visual studio 2008\projects\try\Form1.h(173) : error C2143: syntax error : missing ';' before 'string'
1>c:\documents and settings\victor palad\my documents\visual studio 2008\projects\try\Form1.h(173) : error C4430: missing type specifier - int assumed. Note: C++ does not support default-int
1>c:\documents and settings\victor palad\my documents\visual studio 2008\projects\try\Form1.h(228) : error C2001: newline in constant
1>c:\documents and settings\victor palad\my documents\visual studio 2008\projects\try\Form1.h(228) : error C2015: too many characters in constant
1>c:\documents and settings\victor palad\my documents\visual studio 2008\projects\try\Form1.h(241) : error C2143: syntax error : missing ';' before '.'
1>c:\documents and settings\victor palad\my documents\visual studio 2008\projects\try\Form1.h(241) : error C4430: missing type specifier - int assumed. Note: C++ does not support default-int
1>c:\documents and settings\victor palad\my documents\visual studio 2008\projects\try\Form1.h(271) : error C2001: newline in constant
1>c:\documents and settings\victor palad\my documents\visual studio 2008\projects\try\Form1.h(272) : error C2001: newline in constant
1>.\Try.cpp(6) : error C2143: syntax error : missing ')' before ';'
1>.\Try.cpp(6) : error C2143: syntax error : missing ')' before ';'
1>.\Try.cpp(6) : error C2143: syntax error : missing ')' before ';'
1>.\Try.cpp(8) : error C2337: 'STAThreadAttribute' : attribute not found
1>.\Try.cpp(12) : error C2653: 'Application' : is not a class or namespace name
1>.\Try.cpp(12) : error C3861: 'EnableVisualStyles': identifier not found
1>.\Try.cpp(13) : error C2653: 'Application' : is not a class or namespace name
1>.\Try.cpp(13) : error C3861: 'SetCompatibleTextRenderingDefault': identifier not found
1>.\Try.cpp(16) : error C2653: 'Application' : is not a class or namespace name
1>.\Try.cpp(16) : error C2061: syntax error : identifier 'Form1'
1>.\Try.cpp(16) : error C3861: 'Run': identifier not found
1>Generating Code...
1>Build log was saved at "file://c:\Documents and Settings\Victor Palad\My Documents\Visual Studio 2008\Projects\Try\Debug\BuildLog.htm"
1>Try - 144 error(s), 0 warning(s)
========== Build: 0 succeeded, 1 failed, 0 up-to-date, 0 skipped ==========
Please Help !
Try to use Visual Basic
no nid to have that CODE ahjahah i got my own way of making?
Quote Originally Posted by F l a p J a c K View Post
no nid for VB ehehe!


di wag ka gumamit VB
Posts 1–15 of 18 · Page 1 of 2
This thread is closed for replies.

Similar Threads

Tags for this Thread

Talk with us