Time, date and FPS functions.
Error (showfps):
[php]Compiler: Default compiler
Building Makefile: "C:\Users\usuario\Desktop\Detroyd Hotkeys\Makefile.win"
Executing make...
make.exe -f "C:\Users\usuario\Desktop\Detroyd Hotkeys\Makefile.win" all
gcc.exe -c dllmain.c -o dllmain.o -I"C:/Dev-Cpp/include" -DBUILDING_DLL=1
dllmain.c: In function `Trapaca0':
dllmain.c:25: error: `noFps' undeclared (first use in this function)
dllmain.c:25: error: (Each undeclared identifier is reported only once
dllmain.c:25: error: for each function it appears in.)
dllmain.c:29: error: `FPSxD' undeclared (first use in this function)
dllmain.c:151: error: syntax error at end of input
make.exe: *** [dllmain.o] Error 1
Execution terminated
[/php]
Used DEV-C++, can someno help me?!
[php]Compiler: Default compiler
Building Makefile: "C:\Users\usuario\Desktop\Detroyd Hotkeys\Makefile.win"
Executing make...
make.exe -f "C:\Users\usuario\Desktop\Detroyd Hotkeys\Makefile.win" all
gcc.exe -c dllmain.c -o dllmain.o -I"C:/Dev-Cpp/include" -DBUILDING_DLL=1
dllmain.c: In function `Trapaca0':
dllmain.c:25: error: `noFps' undeclared (first use in this function)
dllmain.c:25: error: (Each undeclared identifier is reported only once
dllmain.c:25: error: for each function it appears in.)
dllmain.c:29: error: `FPSxD' undeclared (first use in this function)
dllmain.c:151: error: syntax error at end of input
make.exe: *** [dllmain.o] Error 1
Execution terminated
[/php]
Used DEV-C++, can someno help me?!
This thread is closed for replies.
