Compiling my dll, Error!

Posts 1–8 of 8 · Page 1 of 1
Compiling my dll, Error!
Here´s my error:

Code:
1>------ Build started: Project: TatniumD3D, Configuration: Debug Win32 ------
1>Compiling...
1>d3d8tex.cpp
1>c:\documents and settings\admin\mijn documenten\zooi\d3d_starterkit_v3.0b\d3d_starterkit_v3.0b\d3d8\d3d8.h(7) : fatal error C1083: Cannot open include file: 'd3d8.h': No such file or directory
1>d3d8int.cpp
1>c:\documents and settings\admin\mijn documenten\zooi\d3d_starterkit_v3.0b\d3d_starterkit_v3.0b\d3d8\d3d8.h(7) : fatal error C1083: Cannot open include file: 'd3d8.h': No such file or directory
1>d3d8dev.cpp
1>c:\documents and settings\admin\mijn documenten\zooi\d3d_starterkit_v3.0b\d3d_starterkit_v3.0b\d3d8\d3d8.h(7) : fatal error C1083: Cannot open include file: 'd3d8.h': No such file or directory
1>main.cpp
1>c:\documents and settings\admin\mijn documenten\zooi\d3d_starterkit_v3.0b\d3d_starterkit_v3.0b\d3d8\d3d8.h(7) : fatal error C1083: Cannot open include file: 'd3d8.h': No such file or directory
1>d3d8.cpp
1>c:\documents and settings\admin\mijn documenten\zooi\d3d_starterkit_v3.0b\d3d_starterkit_v3.0b\d3d8\d3d8.h(7) : fatal error C1083: Cannot open include file: 'd3d8.h': No such file or directory
1>Generating Code...
1>Creating browse information file...
1>Microsoft Browse Information Maintenance Utility Version 9.00.21022
1>Copyright (C) Microsoft Corporation. All rights reserved.
1>BSCMAKE: error BK1506 : cannot open file '.\Debug\main.sbr': No such file or directory
1>Build log was saved at "file://c:\Documents and Settings\Admin\Mijn documenten\ZOOI\D3D_Starterkit_v3.0b\D3D_Starterkit_v3.0b\D3D8\Debug\BuildLog.htm"
1>TatniumD3D - 6 error(s), 0 warning(s)
========== Build: 0 succeeded, 1 failed, 0 up-to-date, 0 skipped ==========
how to fix this? (comes when I compile my dll) From the "D3D8" Folder.
Quote Originally Posted by p0wn4ge View Post
Here´s my error:

Code:
1>------ Build started: Project: TatniumD3D, Configuration: Debug Win32 ------
1>Compiling...
1>d3d8tex.cpp
1>c:documents and settingsadminmijn documentenzooid3d_starterkit_v3.0bd3d_starterkit_v3.0bd3d8d3d8.h(7) : fatal error C1083: Cannot open include file: 'd3d8.h': No such file or directory
1>d3d8int.cpp
1>c:documents and settingsadminmijn documentenzooid3d_starterkit_v3.0bd3d_starterkit_v3.0bd3d8d3d8.h(7) : fatal error C1083: Cannot open include file: 'd3d8.h': No such file or directory
1>d3d8dev.cpp
1>c:documents and settingsadminmijn documentenzooid3d_starterkit_v3.0bd3d_starterkit_v3.0bd3d8d3d8.h(7) : fatal error C1083: Cannot open include file: 'd3d8.h': No such file or directory
1>main.cpp
1>c:documents and settingsadminmijn documentenzooid3d_starterkit_v3.0bd3d_starterkit_v3.0bd3d8d3d8.h(7) : fatal error C1083: Cannot open include file: 'd3d8.h': No such file or directory
1>d3d8.cpp
1>c:documents and settingsadminmijn documentenzooid3d_starterkit_v3.0bd3d_starterkit_v3.0bd3d8d3d8.h(7) : fatal error C1083: Cannot open include file: 'd3d8.h': No such file or directory
1>Generating Code...
1>Creating browse information file...
1>Microsoft Browse Information Maintenance Utility Version 9.00.21022
1>Copyright (C) Microsoft Corporation. All rights reserved.
1>BSCMAKE: error BK1506 : cannot open file '.Debugmain.sbr': No such file or directory
1>Build log was saved at "file://c:Documents and SettingsAdminMijn documentenZOOID3D_Starterkit_v3.0bD3D_Starterkit_v3.0bD3D8DebugBuildLog.htm"
1>TatniumD3D - 6 error(s), 0 warning(s)
========== Build: 0 succeeded, 1 failed, 0 up-to-date, 0 skipped ==========
how to fix this? (comes when I compile my dll) From the "D3D8" Folder.
^^ i try mee too to compile d3d but i get errors in the later step(i resolved all the include errors)
IF your include is between <> means that these include should be in include(visual studio-sub folder) folder,IF is between "" means that the include should be in your project folder.
When i try to compile the d3d(tatnium) i found a lot of INCLUDE errors,u need to go in google and type 'd3d8.h',a good site is Koders than u download those include and put it in the good folder.
(u will get an errors after resolve all include problems,if u know how to "repair" SetCorsorIcon (i haven't got the right code NOW) plz tell me how to do that^^

Sry for my bad english but i think that u understand all.
where are you from? I dont understand it xD
Quote Originally Posted by p0wn4ge View Post
where are you from? I dont understand it xD
You should learn C++ before trying to hack in it. You have to download DX9\8 SDK and plugin the includes\Libs, DX10 SDK doesn't support DX8, so it has to be DX9\8.
got everything now. Already made, close....
Quote Originally Posted by p0wn4ge View Post
got everything now. Already made, close....
^^ sry for my really ba dEng! ; P

Have u compiled your d3d dll?? did u get other errors after have icluded all the file.h??
Quote Originally Posted by p0wn4ge View Post
got everything now. Already made, close....
He has resolved the problem, now quit the discussion here.
I still have this shit problem..

I've got Visual Studio 2008, Dx9 SDK (June 2008)

I'm trying to compile the dx8 example as well.

Error 1 fatal error C1083: Cannot open include file: 'd3dx8.h': No such file or directory d:\dotnet_d3d_hook\d3d8\d3d8.h 8 TatniumD3D
Error 2 fatal error C1083: Cannot open include file: 'd3dx8.h': No such file or directory d:\dotnet_d3d_hook\d3d8\d3d8.h 8 TatniumD3D
Error 3 fatal error C1083: Cannot open include file: 'd3dx8.h': No such file or directory d:\dotnet_d3d_hook\d3d8\d3d8.h 8 TatniumD3D
Error 4 fatal error C1083: Cannot open include file: 'd3dx8.h': No such file or directory d:\dotnet_d3d_hook\d3d8\d3d8.h 8 TatniumD3D
Error 5 fatal error C1083: Cannot open include file: 'd3dx8.h': No such file or directory d:\dotnet_d3d_hook\d3d8\d3d8.h 8 TatniumD3D
Error 6 error BK1506 : cannot open file '.\Debug\main.sbr': No such file or directory BSCMAKE TatniumD3D
Posts 1–8 of 8 · Page 1 of 1
This thread is closed for replies.

Similar Threads

Tags for this Thread

Talk with us