Ajuda com esse erro
Google Tradutor 
1>------ Build started: Project: CABASE, Configuration: Release Win32 ------
1>Compiling...
1>Menu.cpp
1>DirectX.cpp
1>.\DirectX.cpp(65) : error C3861: 'DetourCreate': identifier not found
1>.\DirectX.cpp(66) : error C3861: 'DetourCreate': identifier not found
1>detours.cpp
1>Base.cpp
1>Build log was saved at "file://c:\Users\Lucas\Desktop\CABASE\CABASE\Release\Build Log.htm"
1>CABASE - 2 error(s), 0 warning(s)
========== Build: 0 succeeded, 1 failed, 0 up-to-date, 0 skipped ==========
Erro
mais ajuda-me?

1>------ Build started: Project: CABASE, Configuration: Release Win32 ------
1>Compiling...
1>Menu.cpp
1>DirectX.cpp
1>.\DirectX.cpp(65) : error C3861: 'DetourCreate': identifier not found
1>.\DirectX.cpp(66) : error C3861: 'DetourCreate': identifier not found
1>detours.cpp
1>Base.cpp
1>Build log was saved at "file://c:\Users\Lucas\Desktop\CABASE\CABASE\Release\Build Log.htm"
1>CABASE - 2 error(s), 0 warning(s)
========== Build: 0 succeeded, 1 failed, 0 up-to-date, 0 skipped ==========
Erro
mais ajuda-me?