Thumbs up[Source Code]M.A.T. Double Jump / Multi-jump

Posts 1–15 of 45 · Page 1 of 3
[Source Code]M.A.T. Double Jump / Multi-jump
Code:
class AKFXPawnBase : public APawn //0x88C -> 0xC48
{
public:

	...
	
	INT MultiJumpRemaining; /* 0x00000AE4 */
	INT MaxMultiJump; 		/* 0x00000AE8 */
	INT DoubleJumpZ; 		/* 0x00000AEC */
	
	...
	
};

AKFXPawnBase* pLocalKFXPawn = reinterpret_cast< AKFXPawnBase* >( GEngine->GetLocalObject( AKFXPawnBase::StaticClass() ) );
pLocalKFXPawn->MultiJumpRemaining = 1337; //I don't think you need to do this, but w/e
pLocalKFXPawn->MaxMultiJump = 1337; //Generally... it's 2 but if you want to keep jumping
pLocalKFXPawn->DoubleJumpZ = 800; //Max :O U can log for original double jump z, which is 400 something...
For people who don't have their own SDK, you can do this.

Code:
*(INT*)( GEngine->GetLocalPawn() + 0xAE4 ) = 1337;
*(INT*)( GEngine->GetLocalPawn() + 0xAE8 ) = 1337;
*(INT*)( GEngine->GetLocalPawn() + 0xAEC ) = 800;
Enjoy
Credit To=Code[V]
Thank You
im a noob in this so what do you have to do?
ehm
i new to this...i dont really know how to hack :P
what do i do with the codes?
In Order to Make This Work We Need to Compile This With Bypass Code
if you want to learn to know what this means you can learning how to code with some of our extensive guides and books in our C++ section.
WHAT CAN DO WITH THIS CODE!!!
CAN TELL ME!!!
OR GIFT LINK TO ME
you play cibmall??
1>------ Build started: Project: jump_MAT, Configuration: Debug Win32 ------
1> jump_MAT.cpp
1>c:\documents and settings\toshiba\my documents\visual studio 2010\projects\jump_mat\jump_mat\jump_MAT.h(15): error C2504: 'APawn' : base class undefined
1>c:\documents and settings\toshiba\my documents\visual studio 2010\projects\jump_mat\jump_mat\jump_MAT.h(18): error C2059: syntax error : '...'
1>c:\documents and settings\toshiba\my documents\visual studio 2010\projects\jump_mat\jump_mat\jump_MAT.h(20): error C2238: unexpected token(s) preceding ';'
1>c:\documents and settings\toshiba\my documents\visual studio 2010\projects\jump_mat\jump_mat\jump_MAT.h(21): error C2146: syntax error : missing ';' before identifier 'MaxMultiJump'
1>c:\documents and settings\toshiba\my documents\visual studio 2010\projects\jump_mat\jump_mat\jump_MAT.h(21): error C4430: missing type specifier - int assumed. Note: C++ does not support default-int
1>c:\documents and settings\toshiba\my documents\visual studio 2010\projects\jump_mat\jump_mat\jump_MAT.h(21): error C4430: missing type specifier - int assumed. Note: C++ does not support default-int
1>c:\documents and settings\toshiba\my documents\visual studio 2010\projects\jump_mat\jump_mat\jump_MAT.h(22): error C2146: syntax error : missing ';' before identifier 'DoubleJumpZ'
1>c:\documents and settings\toshiba\my documents\visual studio 2010\projects\jump_mat\jump_mat\jump_MAT.h(22): error C4430: missing type specifier - int assumed. Note: C++ does not support default-int
1>c:\documents and settings\toshiba\my documents\visual studio 2010\projects\jump_mat\jump_mat\jump_MAT.h(22): error C4430: missing type specifier - int assumed. Note: C++ does not support default-int
1>c:\documents and settings\toshiba\my documents\visual studio 2010\projects\jump_mat\jump_mat\jump_MAT.h(24): error C2059: syntax error : '...'
1>c:\documents and settings\toshiba\my documents\visual studio 2010\projects\jump_mat\jump_mat\jump_MAT.h(26): error C2143: syntax error : missing ';' before '}'
1>c:\documents and settings\toshiba\my documents\visual studio 2010\projects\jump_mat\jump_mat\jump_MAT.h(26): error C2238: unexpected token(s) preceding ';'
1>c:\documents and settings\toshiba\my documents\visual studio 2010\projects\jump_mat\jump_mat\jump_MAT.h(28): error C2065: 'GEngine' : undeclared identifier
1>c:\documents and settings\toshiba\my documents\visual studio 2010\projects\jump_mat\jump_mat\jump_MAT.h(28): error C2227: left of '->GetLocalObject' must point to class/struct/union/generic type
1> type is ''unknown-type''
1>c:\documents and settings\toshiba\my documents\visual studio 2010\projects\jump_mat\jump_mat\jump_MAT.h(28): error C2039: 'StaticClass' : is not a member of 'AKFXPawnBase'
1> c:\documents and settings\toshiba\my documents\visual studio 2010\projects\jump_mat\jump_mat\jump_MAT.h(14) : see declaration of 'AKFXPawnBase'
1>c:\documents and settings\toshiba\my documents\visual studio 2010\projects\jump_mat\jump_mat\jump_MAT.h(28): error C3861: 'StaticClass': identifier not found
1>c:\documents and settings\toshiba\my documents\visual studio 2010\projects\jump_mat\jump_mat\jump_MAT.h(29): error C2143: syntax error : missing ';' before '->'
1>c:\documents and settings\toshiba\my documents\visual studio 2010\projects\jump_mat\jump_mat\jump_MAT.h(29): error C4430: missing type specifier - int assumed. Note: C++ does not support default-int
1>c:\documents and settings\toshiba\my documents\visual studio 2010\projects\jump_mat\jump_mat\jump_MAT.h(29): error C2040: 'pLocalKFXPawn' : 'int' differs in levels of indirection from 'AKFXPawnBase *'
1>c:\documents and settings\toshiba\my documents\visual studio 2010\projects\jump_mat\jump_mat\jump_MAT.h(30): error C2143: syntax error : missing ';' before '->'
1>c:\documents and settings\toshiba\my documents\visual studio 2010\projects\jump_mat\jump_mat\jump_MAT.h(30): error C4430: missing type specifier - int assumed. Note: C++ does not support default-int
1>c:\documents and settings\toshiba\my documents\visual studio 2010\projects\jump_mat\jump_mat\jump_MAT.h(30): error C2040: 'pLocalKFXPawn' : 'int' differs in levels of indirection from 'AKFXPawnBase *'
1>c:\documents and settings\toshiba\my documents\visual studio 2010\projects\jump_mat\jump_mat\jump_MAT.h(31): error C2143: syntax error : missing ';' before '->'
1>c:\documents and settings\toshiba\my documents\visual studio 2010\projects\jump_mat\jump_mat\jump_MAT.h(31): error C4430: missing type specifier - int assumed. Note: C++ does not support default-int
1>c:\documents and settings\toshiba\my documents\visual studio 2010\projects\jump_mat\jump_mat\jump_MAT.h(31): error C2040: 'pLocalKFXPawn' : 'int' differs in levels of indirection from 'AKFXPawnBase *'
========== Build: 0 succeeded, 1 failed, 0 up-to-date, 0 skipped ==========
Quote Originally Posted by SkynetVirus View Post
1>------ Build started: Project: jump_MAT, Configuration: Debug Win32 ------
1> jump_MAT.cpp
1>c:\documents and settings\toshiba\my documents\visual studio 2010\projects\jump_mat\jump_mat\jump_MAT.h(15): error C2504: 'APawn' : base class undefined
1>c:\documents and settings\toshiba\my documents\visual studio 2010\projects\jump_mat\jump_mat\jump_MAT.h(18): error C2059: syntax error : '...'
1>c:\documents and settings\toshiba\my documents\visual studio 2010\projects\jump_mat\jump_mat\jump_MAT.h(20): error C2238: unexpected token(s) preceding ';'
1>c:\documents and settings\toshiba\my documents\visual studio 2010\projects\jump_mat\jump_mat\jump_MAT.h(21): error C2146: syntax error : missing ';' before identifier 'MaxMultiJump'
1>c:\documents and settings\toshiba\my documents\visual studio 2010\projects\jump_mat\jump_mat\jump_MAT.h(21): error C4430: missing type specifier - int assumed. Note: C++ does not support default-int
1>c:\documents and settings\toshiba\my documents\visual studio 2010\projects\jump_mat\jump_mat\jump_MAT.h(21): error C4430: missing type specifier - int assumed. Note: C++ does not support default-int
1>c:\documents and settings\toshiba\my documents\visual studio 2010\projects\jump_mat\jump_mat\jump_MAT.h(22): error C2146: syntax error : missing ';' before identifier 'DoubleJumpZ'
1>c:\documents and settings\toshiba\my documents\visual studio 2010\projects\jump_mat\jump_mat\jump_MAT.h(22): error C4430: missing type specifier - int assumed. Note: C++ does not support default-int
1>c:\documents and settings\toshiba\my documents\visual studio 2010\projects\jump_mat\jump_mat\jump_MAT.h(22): error C4430: missing type specifier - int assumed. Note: C++ does not support default-int
1>c:\documents and settings\toshiba\my documents\visual studio 2010\projects\jump_mat\jump_mat\jump_MAT.h(24): error C2059: syntax error : '...'
1>c:\documents and settings\toshiba\my documents\visual studio 2010\projects\jump_mat\jump_mat\jump_MAT.h(26): error C2143: syntax error : missing ';' before '}'
1>c:\documents and settings\toshiba\my documents\visual studio 2010\projects\jump_mat\jump_mat\jump_MAT.h(26): error C2238: unexpected token(s) preceding ';'
1>c:\documents and settings\toshiba\my documents\visual studio 2010\projects\jump_mat\jump_mat\jump_MAT.h(28): error C2065: 'GEngine' : undeclared identifier
1>c:\documents and settings\toshiba\my documents\visual studio 2010\projects\jump_mat\jump_mat\jump_MAT.h(28): error C2227: left of '->GetLocalObject' must point to class/struct/union/generic type
1> type is ''unknown-type''
1>c:\documents and settings\toshiba\my documents\visual studio 2010\projects\jump_mat\jump_mat\jump_MAT.h(28): error C2039: 'StaticClass' : is not a member of 'AKFXPawnBase'
1> c:\documents and settings\toshiba\my documents\visual studio 2010\projects\jump_mat\jump_mat\jump_MAT.h(14) : see declaration of 'AKFXPawnBase'
1>c:\documents and settings\toshiba\my documents\visual studio 2010\projects\jump_mat\jump_mat\jump_MAT.h(28): error C3861: 'StaticClass': identifier not found
1>c:\documents and settings\toshiba\my documents\visual studio 2010\projects\jump_mat\jump_mat\jump_MAT.h(29): error C2143: syntax error : missing ';' before '->'
1>c:\documents and settings\toshiba\my documents\visual studio 2010\projects\jump_mat\jump_mat\jump_MAT.h(29): error C4430: missing type specifier - int assumed. Note: C++ does not support default-int
1>c:\documents and settings\toshiba\my documents\visual studio 2010\projects\jump_mat\jump_mat\jump_MAT.h(29): error C2040: 'pLocalKFXPawn' : 'int' differs in levels of indirection from 'AKFXPawnBase *'
1>c:\documents and settings\toshiba\my documents\visual studio 2010\projects\jump_mat\jump_mat\jump_MAT.h(30): error C2143: syntax error : missing ';' before '->'
1>c:\documents and settings\toshiba\my documents\visual studio 2010\projects\jump_mat\jump_mat\jump_MAT.h(30): error C4430: missing type specifier - int assumed. Note: C++ does not support default-int
1>c:\documents and settings\toshiba\my documents\visual studio 2010\projects\jump_mat\jump_mat\jump_MAT.h(30): error C2040: 'pLocalKFXPawn' : 'int' differs in levels of indirection from 'AKFXPawnBase *'
1>c:\documents and settings\toshiba\my documents\visual studio 2010\projects\jump_mat\jump_mat\jump_MAT.h(31): error C2143: syntax error : missing ';' before '->'
1>c:\documents and settings\toshiba\my documents\visual studio 2010\projects\jump_mat\jump_mat\jump_MAT.h(31): error C4430: missing type specifier - int assumed. Note: C++ does not support default-int
1>c:\documents and settings\toshiba\my documents\visual studio 2010\projects\jump_mat\jump_mat\jump_MAT.h(31): error C2040: 'pLocalKFXPawn' : 'int' differs in levels of indirection from 'AKFXPawnBase *'
========== Build: 0 succeeded, 1 failed, 0 up-to-date, 0 skipped ==========
...What's this?...
AHAHAHAHAHA

hey thedoctor can u send me the models from this game? or is not a lith tech engine game?
this only work for SUBA.
one more the thread maker dunno make a hack
he just know to release the codes only..useless.
Noob Post the codes in codes section!

Better Dont coppy paste From other Site !
Quote Originally Posted by xdajay View Post
Noob Post the codes in codes section!

Better Dont coppy paste From other Site !
What U Talking About?
I Dont Care
thedoctor which motor use this game?
Posts 1–15 of 45 · Page 1 of 3
This thread is closed for replies.

Similar Threads

Tags for this Thread

None

Talk with us