i've maked the dll file, but when try to build it i get some errors, why?! please help me =((
New ESP Codes
me too there are too many problem :/
good job...
People, why posting codes without knowing any programming language :<
dll file please 

Can someone make the dll file for me? cause my pc dont have enough memory, so i cant install Microsoft Visual C++ 2010, 300 MB left in C drive
If someone will post a DLL file, then everyone will have it and be detected after a while.
ARGH!!, why i cant make the dll? it said build error!! whether there is something wrong on the code?
the result :
1>------ Build started: Project: EEEE, Configuration: Release Win32 ------
1> ESP.cpp
1>ESP.cpp(4): error C2065: 'UCanvas' : undeclared identifier
1>ESP.cpp(4): error C2065: 'pCanvas' : undeclared identifier
1>ESP.cpp(4): error C2065: 'AcAPBPawn' : undeclared identifier
1>ESP.cpp(4): error C2065: 'pPawn' : undeclared identifier
1>ESP.cpp(4): error C2065: 'FColor' : undeclared identifier
1>ESP.cpp(4): error C2146: syntax error : missing ')' before identifier 'Color'
1>ESP.cpp(4): error C2182: 'Name' : illegal use of type 'void'
1>ESP.cpp(4): error C2078: too many initializers
1>ESP.cpp(4): error C2059: syntax error : ')'
1>ESP.cpp(5): error C2143: syntax error : missing ';' before '{'
1>ESP.cpp(5): error C2447: '{' : missing function header (old-style formal list?)
========== Build: 0 succeeded, 1 failed, 0 up-to-date, 0 skipped ==========
the result :
1>------ Build started: Project: EEEE, Configuration: Release Win32 ------
1> ESP.cpp
1>ESP.cpp(4): error C2065: 'UCanvas' : undeclared identifier
1>ESP.cpp(4): error C2065: 'pCanvas' : undeclared identifier
1>ESP.cpp(4): error C2065: 'AcAPBPawn' : undeclared identifier
1>ESP.cpp(4): error C2065: 'pPawn' : undeclared identifier
1>ESP.cpp(4): error C2065: 'FColor' : undeclared identifier
1>ESP.cpp(4): error C2146: syntax error : missing ')' before identifier 'Color'
1>ESP.cpp(4): error C2182: 'Name' : illegal use of type 'void'
1>ESP.cpp(4): error C2078: too many initializers
1>ESP.cpp(4): error C2059: syntax error : ')'
1>ESP.cpp(5): error C2143: syntax error : missing ';' before '{'
1>ESP.cpp(5): error C2447: '{' : missing function header (old-style formal list?)
========== Build: 0 succeeded, 1 failed, 0 up-to-date, 0 skipped ==========
i compiled everything and it worked ^^ great
, imma see if i can put everything into one hack it will be awesum 
, imma see if i can put everything into one hack it will be awesum 
I wouldn't suggest using the APBVtable.dll included, it will let you play (Only crosshair working) and then once you log out they will have your ACCs banned.
This thread is closed for replies.
Similar Threads
WarRock - International Hacksnew promo code (test)
3 WarRock - International Hacksnew promo code generator 104 Trade Accounts/Keys/ItemsTrade m60 retail code and new gun code 9 Blackshot Hacks & Cheatsany 1 found out the new mastery code?
3 Call of Duty Modern Warfare 2 HelpNEW ESP HACK NOT RELEASE
3


