[ERRO na Base] Combat arms
Como Corrigir o Erro ? Base já é Atualizada!
1>------ Build started: Project: CA_base_unk_v1, Configuration: Debug Win32 ------
1>Build started 20/03/2013 00:37:18.
1>InitializeBuildStatus:
1> Touching "Debug\CA_base_unk_v1.unsuccessfulbuild".
1>ClCompile:
1> tools.cpp
1>c:\users\user\desktop\matypatty\includes.h(12): fatal error C1083: Cannot open include file: 'd3dx9.h': No such file or directory
1> menu.cpp
1>c:\users\user\desktop\matypatty\includes.h(12): fatal error C1083: Cannot open include file: 'd3dx9.h': No such file or directory
1> main.cpp
1>c:\users\user\desktop\matypatty\includes.h(12): fatal error C1083: Cannot open include file: 'd3dx9.h': No such file or directory
1> hacks.cpp
1>c:\users\user\desktop\matypatty\includes.h(12): fatal error C1083: Cannot open include file: 'd3dx9.h': No such file or directory
1> esp.cpp
1>c:\users\user\desktop\matypatty\includes.h(12): fatal error C1083: Cannot open include file: 'd3dx9.h': No such file or directory
1> d3d.cpp
1>c:\users\user\desktop\matypatty\includes.h(12): fatal error C1083: Cannot open include file: 'd3dx9.h': No such file or directory
1> aimbot.cpp
1>c:\users\user\desktop\matypatty\includes.h(12): fatal error C1083: Cannot open include file: 'd3dx9.h': No such file or directory
1> Generating Code...
1>
1>Build FAILED.
1>
1>Time Elapsed 00:00:02.41
========== Build: 0 succeeded, 1 failed, 0 up-to-date, 0 skipped ==========
1>------ Build started: Project: CA_base_unk_v1, Configuration: Debug Win32 ------
1>Build started 20/03/2013 00:37:18.
1>InitializeBuildStatus:
1> Touching "Debug\CA_base_unk_v1.unsuccessfulbuild".
1>ClCompile:
1> tools.cpp
1>c:\users\user\desktop\matypatty\includes.h(12): fatal error C1083: Cannot open include file: 'd3dx9.h': No such file or directory
1> menu.cpp
1>c:\users\user\desktop\matypatty\includes.h(12): fatal error C1083: Cannot open include file: 'd3dx9.h': No such file or directory
1> main.cpp
1>c:\users\user\desktop\matypatty\includes.h(12): fatal error C1083: Cannot open include file: 'd3dx9.h': No such file or directory
1> hacks.cpp
1>c:\users\user\desktop\matypatty\includes.h(12): fatal error C1083: Cannot open include file: 'd3dx9.h': No such file or directory
1> esp.cpp
1>c:\users\user\desktop\matypatty\includes.h(12): fatal error C1083: Cannot open include file: 'd3dx9.h': No such file or directory
1> d3d.cpp
1>c:\users\user\desktop\matypatty\includes.h(12): fatal error C1083: Cannot open include file: 'd3dx9.h': No such file or directory
1> aimbot.cpp
1>c:\users\user\desktop\matypatty\includes.h(12): fatal error C1083: Cannot open include file: 'd3dx9.h': No such file or directory
1> Generating Code...
1>
1>Build FAILED.
1>
1>Time Elapsed 00:00:02.41
========== Build: 0 succeeded, 1 failed, 0 up-to-date, 0 skipped ==========


