SolvedErro ao compilar

Posts 1–15 of 23 · Page 1 of 2
Erro ao compilar
qualquer base q vou compilar, da 408 erros. '-'


1>------ Rebuild All started: Project: CABASE, Configuration: Release Win32 ------
1>Deleting intermediate and output files for project 'CABASE', configuration 'Release|Win32'
1>Compiling...
1>Menu.cpp
1>C:\Program Files\Microsoft Visual Studio 9.0\VC\include\excpt.h(60) : error C2337: 'SA_Pre' : attribute not found
1>C:\Program Files\Microsoft Visual Studio 9.0\VC\include\excpt.h(60) : error C2065: 'SA_No' : undeclared identifier
1> missing quotes ("") around 'SA_No'?
1>C:\Program Files\Microsoft Visual Studio 9.0\VC\include\excpt.h(60) : error C2337: 'SA_Pre' : attribute not found
1>C:\Program Files\Microsoft Visual Studio 9.0\VC\include\excpt.h(60) : error C2065: 'SA_Yes' : undeclared identifier
1> missing quotes ("") around 'SA_Yes'?
1>C:\Program Files\Microsoft Visual Studio 9.0\VC\include\excpt.h(60) : error C2065: 'SA_Read' : undeclared identifier
1> missing quotes ("") around 'SA_Read'?
1>C:\Program Files\Microsoft Visual Studio 9.0\VC\include\excpt.h(61) : error C2337: 'SA_Pre' : attribute not found
1>C:\Program Files\Microsoft Visual Studio 9.0\VC\include\excpt.h(61) : error C2065: 'SA_No' : undeclared identifier
1> missing quotes ("") around 'SA_No'?
1>C:\Program Files\Microsoft Visual Studio 9.0\VC\include\excpt.h(61) : error C2337: 'SA_Pre' : attribute not found
1>C:\Program Files\Microsoft Visual Studio 9.0\VC\include\excpt.h(61) : error C2065: 'SA_Yes' : undeclared identifier
1> missing quotes ("") around 'SA_Yes'?
1>C:\Program Files\Microsoft Visual Studio 9.0\VC\include\excpt.h(61) : error C2065: 'SA_Read' : undeclared identifier
1> missing quotes ("") around 'SA_Read'?
1>C:\Program Files\Microsoft Visual Studio 9.0\VC\include\excpt.h(62) : error C2337: 'SA_Pre' : attribute not found
1>C:\Program Files\Microsoft Visual Studio 9.0\VC\include\excpt.h(62) : error C2065: 'SA_No' : undeclared identifier
1> missing quotes ("") around 'SA_No'?
1>C:\Program Files\Microsoft Visual Studio 9.0\VC\include\excpt.h(62) : error C2337: 'SA_Pre' : attribute not found
1>C:\Program Files\Microsoft Visual Studio 9.0\VC\include\excpt.h(62) : error C2065: 'SA_Yes' : undeclared identifier
1> missing quotes ("") around 'SA_Yes'?
1>C:\Program Files\Microsoft Visual Studio 9.0\VC\include\excpt.h(62) : error C2337: 'SA_Post' : attribute not found
1>C:\Program Files\Microsoft Visual Studio 9.0\VC\include\excpt.h(62) : error C2065: 'SA_Yes' : undeclared identifier
1> missing quotes ("") around 'SA_Yes'?
1>C:\Program Files\Microsoft Visual Studio 9.0\VC\include\excpt.h(63) : error C2337: 'SA_Pre' : attribute not found
1>C:\Program Files\Microsoft Visual Studio 9.0\VC\include\excpt.h(63) : error C2065: 'SA_No' : undeclared identifier
1> missing quotes ("") around 'SA_No'?
1>C:\Program Files\Microsoft Visual Studio 9.0\VC\include\excpt.h(63) : error C2337: 'SA_Pre' : attribute not found
1>C:\Program Files\Microsoft Visual Studio 9.0\VC\include\excpt.h(63) : error C2065: 'SA_Yes' : undeclared identifier
1> missing quotes ("") around 'SA_Yes'?
1>C:\Program Files\Microsoft Visual Studio 9.0\VC\include\excpt.h(63) : error C2337: 'SA_Post' : attribute not found
1>C:\Program Files\Microsoft Visual Studio 9.0\VC\include\excpt.h(63) : error C2065: 'SA_Yes' : undeclared identifier
1> missing quotes ("") around 'SA_Yes'?
1>C:\Program Files\Microsoft Visual Studio 9.0\VC\include\ctype.h(94) : error C2337: 'SA_Post' : attribute not found
1>C:\Program Files\Microsoft Visual Studio 9.0\VC\include\ctype.h(94) : error C2065: 'SA_Yes' : undeclared identifier
1> missing quotes ("") around 'SA_Yes'?
1>C:\Program Files\Microsoft Visual Studio 9.0\VC\include\ctype.h(94) : error C2337: 'SA_Pre' : attribute not found
1>C:\Program Files\Microsoft Visual Studio 9.0\VC\include\ctype.h(94) : error C2065: 'SA_No' : undeclared identifier
1> missing quotes ("") around 'SA_No'?
1>C:\Program Files\Microsoft Visual Studio 9.0\VC\include\ctype.h(94) : error C2337: 'SA_Pre' : attribute not found
1>C:\Program Files\Microsoft Visual Studio 9.0\VC\include\ctype.h(94) : error C2065: 'SA_Yes' : undeclared identifier
1> missing quotes ("") around 'SA_Yes'?
1>C:\Program Files\Microsoft Visual Studio 9.0\VC\include\ctype.h(94) : error C2065: 'SA_Read' : undeclared identifier
1> missing quotes ("") around 'SA_Read'?
1>C:\Program Files\Microsoft Visual Studio 9.0\VC\include\ctype.h(94) : error C2337: 'SA_Pre' : attribute not found
1>C:\Program Files\Microsoft Visual Studio 9.0\VC\include\ctype.h(94) : error C2065: 'SA_No' : undeclared identifier
1> missing quotes ("") around 'SA_No'?
1>C:\Program Files\Microsoft Visual Studio 9.0\VC\include\ctype.h(94) : error C2337: 'SA_Pre' : attribute not found
1>C:\Program Files\Microsoft Visual Studio 9.0\VC\include\ctype.h(94) : error C2065: 'SA_Yes' : undeclared identifier
1> missing quotes ("") around 'SA_Yes'?
1>C:\Program Files\Microsoft Visual Studio 9.0\VC\include\ctype.h(94) : error C2065: 'SA_Read' : undeclared identifier
1> missing quotes ("") around 'SA_Read'?
1>C:\Program Files\Microsoft Visual Studio 9.0\VC\include\ctype.h(95) : error C2337: 'SA_Post' : attribute not found
1>C:\Program Files\Microsoft Visual Studio 9.0\VC\include\ctype.h(95) : error C2065: 'SA_Yes' : undeclared identifier
1> missing quotes ("") around 'SA_Yes'?
1>C:\Program Files\Microsoft Visual Studio 9.0\VC\include\ctype.h(95) : error C2337: 'SA_Pre' : attribute not found
1>C:\Program Files\Microsoft Visual Studio 9.0\VC\include\ctype.h(95) : error C2065: 'SA_No' : undeclared identifier
1> missing quotes ("") around 'SA_No'?
1>C:\Program Files\Microsoft Visual Studio 9.0\VC\include\ctype.h(95) : error C2337: 'SA_Pre' : attribute not found
1>C:\Program Files\Microsoft Visual Studio 9.0\VC\include\ctype.h(95) : error C2065: 'SA_Yes' : undeclared identifier
1> missing quotes ("") around 'SA_Yes'?
1>C:\Program Files\Microsoft Visual Studio 9.0\VC\include\ctype.h(95) : error C2065: 'SA_Read' : undeclared identifier
1> missing quotes ("") around 'SA_Read'?
1>C:\Program Files\Microsoft Visual Studio 9.0\VC\include\ctype.h(95) : error C2337: 'SA_Pre' : attribute not found
1>C:\Program Files\Microsoft Visual Studio 9.0\VC\include\ctype.h(95) : error C2065: 'SA_No' : undeclared identifier
1> missing quotes ("") around 'SA_No'?
1>C:\Program Files\Microsoft Visual Studio 9.0\VC\include\ctype.h(95) : error C2337: 'SA_Pre' : attribute not found
1>C:\Program Files\Microsoft Visual Studio 9.0\VC\include\ctype.h(95) : error C2065: 'SA_Yes' : undeclared identifier
1> missing quotes ("") around 'SA_Yes'?
1>C:\Program Files\Microsoft Visual Studio 9.0\VC\include\ctype.h(95) : error C2065: 'SA_Read' : undeclared identifier
1> missing quotes ("") around 'SA_Read'?
1>C:\Program Files\Microsoft Visual Studio 9.0\VC\include\ctype.h(95) : error C2337: 'SA_Pre' : attribute not found
1>C:\Program Files\Microsoft Visual Studio 9.0\VC\include\ctype.h(95) : error C2065: 'SA_Maybe' : undeclared identifier
1> missing quotes ("") around 'SA_Maybe'?
1>C:\Program Files\Microsoft Visual Studio 9.0\VC\include\ctype.h(95) : error C2337: 'SA_Pre' : attribute not found
1>C:\Program Files\Microsoft Visual Studio 9.0\VC\include\ctype.h(95) : error C2065: 'SA_Yes' : undeclared identifier
1> missing quotes ("") around 'SA_Yes'?
1>C:\Program Files\Microsoft Visual Studio 9.0\VC\include\ctype.h(95) : error C2337: 'SA_Pre' : attribute not found
1>C:\Program Files\Microsoft Visual Studio 9.0\VC\include\ctype.h(95) : error C2065: 'SA_Read' : undeclared identifier
1> missing quotes ("") around 'SA_Read'?
1>C:\Program Files\Microsoft Visual Studio 9.0\VC\include\ctype.h(96) : error C2337: 'SA_Post' : attribute not found
1>C:\Program Files\Microsoft Visual Studio 9.0\VC\include\ctype.h(96) : error C2065: 'SA_Yes' : undeclared identifier
1> missing quotes ("") around 'SA_Yes'?
1>C:\Program Files\Microsoft Visual Studio 9.0\VC\include\ctype.h(96) : error C2337: 'SA_Pre' : attribute not found
1>C:\Program Files\Microsoft Visual Studio 9.0\VC\include\ctype.h(96) : error C2065: 'SA_No' : undeclared identifier
1> missing quotes ("") around 'SA_No'?
1>C:\Program Files\Microsoft Visual Studio 9.0\VC\include\ctype.h(96) : error C2337: 'SA_Pre' : attribute not found
1>C:\Program Files\Microsoft Visual Studio 9.0\VC\include\ctype.h(96) : error C2065: 'SA_Yes' : undeclared identifier
1> missing quotes ("") around 'SA_Yes'?
1>C:\Program Files\Microsoft Visual Studio 9.0\VC\include\ctype.h(96) : error C2065: 'SA_Read' : undeclared identifier
1> missing quotes ("") around 'SA_Read'?
1>C:\Program Files\Microsoft Visual Studio 9.0\VC\include\ctype.h(97) : error C2337: 'SA_Post' : attribute not found
1>C:\Program Files\Microsoft Visual Studio 9.0\VC\include\ctype.h(97) : error C2065: 'SA_Yes' : undeclared identifier
1> missing quotes ("") around 'SA_Yes'?
1>C:\Program Files\Microsoft Visual Studio 9.0\VC\include\ctype.h(97) : error C2337: 'SA_Pre' : attribute not found
1>C:\Program Files\Microsoft Visual Studio 9.0\VC\include\ctype.h(97) : error C2065: 'SA_No' : undeclared identifier
1> missing quotes ("") around 'SA_No'?
1>C:\Program Files\Microsoft Visual Studio 9.0\VC\include\ctype.h(97) : error C2337: 'SA_Pre' : attribute not found
1>C:\Program Files\Microsoft Visual Studio 9.0\VC\include\ctype.h(97) : error C2065: 'SA_Yes' : undeclared identifier
1> missing quotes ("") around 'SA_Yes'?
1>C:\Program Files\Microsoft Visual Studio 9.0\VC\include\ctype.h(97) : error C2065: 'SA_Read' : undeclared identifier
1> missing quotes ("") around 'SA_Read'?
1>C:\Program Files\Microsoft Visual Studio 9.0\VC\include\ctype.h(97) : error C2337: 'SA_Pre' : attribute not found
1>C:\Program Files\Microsoft Visual Studio 9.0\VC\include\ctype.h(97) : error C2065: 'SA_Maybe' : undeclared identifier
1> missing quotes ("") around 'SA_Maybe'?
1>C:\Program Files\Microsoft Visual Studio 9.0\VC\include\ctype.h(97) : error C2337: 'SA_Pre' : attribute not found
1>C:\Program Files\Microsoft Visual Studio 9.0\VC\include\ctype.h(97) : error C2065: 'SA_Yes' : undeclared identifier
1> missing quotes ("") around 'SA_Yes'?
1>C:\Program Files\Microsoft Visual Studio 9.0\VC\include\ctype.h(97) : error C2337: 'SA_Pre' : attribute not found
1>C:\Program Files\Microsoft Visual Studio 9.0\VC\include\ctype.h(97) : error C2065: 'SA_Read' : undeclared identifier
1> missing quotes ("") around 'SA_Read'?
1>C:\Program Files\Microsoft Visual Studio 9.0\VC\include\ctype.h(98) : error C2337: 'SA_Post' : attribute not found
1>C:\Program Files\Microsoft Visual Studio 9.0\VC\include\ctype.h(98) : error C2065: 'SA_Yes' : undeclared identifier
1> missing quotes ("") around 'SA_Yes'?
1>C:\Program Files\Microsoft Visual Studio 9.0\VC\include\ctype.h(98) : error C2337: 'SA_Pre' : attribute not found
1>C:\Program Files\Microsoft Visual Studio 9.0\VC\include\ctype.h(98) : error C2065: 'SA_No' : undeclared identifier
1> missing quotes ("") around 'SA_No'?
1>C:\Program Files\Microsoft Visual Studio 9.0\VC\include\ctype.h(98) : error C2337: 'SA_Pre' : attribute not found
1>C:\Program Files\Microsoft Visual Studio 9.0\VC\include\ctype.h(98) : error C2065: 'SA_Yes' : undeclared identifier
1> missing quotes ("") around 'SA_Yes'?
1>C:\Program Files\Microsoft Visual Studio 9.0\VC\include\ctype.h(98) : error C2065: 'SA_Read' : undeclared identifier
1> missing quotes ("") around 'SA_Read'?
1>C:\Program Files\Microsoft Visual Studio 9.0\VC\include\ctype.h(99) : error C2337: 'SA_Post' : attribute not found
1>C:\Program Files\Microsoft Visual Studio 9.0\VC\include\ctype.h(99) : error C2065: 'SA_Yes' : undeclared identifier
1> missing quotes ("") around 'SA_Yes'?
1>C:\Program Files\Microsoft Visual Studio 9.0\VC\include\ctype.h(99) : error C2337: 'SA_Pre' : attribute not found
1>C:\Program Files\Microsoft Visual Studio 9.0\VC\include\ctype.h(99) : error C2065: 'SA_No' : undeclared identifier
1> missing quotes ("") around 'SA_No'?
1>C:\Program Files\Microsoft Visual Studio 9.0\VC\include\ctype.h(99) : error C2337: 'SA_Pre' : attribute not found
1>C:\Program Files\Microsoft Visual Studio 9.0\VC\include\ctype.h(99) : error C2065: 'SA_Yes' : undeclared identifier
1> missing quotes ("") around 'SA_Yes'?
1>C:\Program Files\Microsoft Visual Studio 9.0\VC\include\ctype.h(99) : error C2065: 'SA_Read' : undeclared identifier
1> missing quotes ("") around 'SA_Read'?
1>C:\Program Files\Microsoft Visual Studio 9.0\VC\include\ctype.h(99) : error C2337: 'SA_Pre' : attribute not found
1>C:\Program Files\Microsoft Visual Studio 9.0\VC\include\ctype.h(99) : error C2065: 'SA_Maybe' : undeclared identifier
1> missing quotes ("") around 'SA_Maybe'?
1>C:\Program Files\Microsoft Visual Studio 9.0\VC\include\ctype.h(99) : error C2337: 'SA_Pre' : attribute not found
1>C:\Program Files\Microsoft Visual Studio 9.0\VC\include\ctype.h(99) : error C2065: 'SA_Yes' : undeclared identifier
1> missing quotes ("") around 'SA_Yes'?
1>C:\Program Files\Microsoft Visual Studio 9.0\VC\include\ctype.h(99) : error C2337: 'SA_Pre' : attribute not found
1>C:\Program Files\Microsoft Visual Studio 9.0\VC\include\ctype.h(99) : error C2065: 'SA_Read' : undeclared identifier
1> missing quotes ("") around 'SA_Read'?
1>C:\Program Files\Microsoft Visual Studio 9.0\VC\include\ctype.h(100) : error C2337: 'SA_Post' : attribute not found
1>C:\Program Files\Microsoft Visual Studio 9.0\VC\include\ctype.h(100) : error C2065: 'SA_Yes' : undeclared identifier
1> missing quotes ("") around 'SA_Yes'?
1>C:\Program Files\Microsoft Visual Studio 9.0\VC\include\ctype.h(100) : error C2337: 'SA_Pre' : attribute not found
1>C:\Program Files\Microsoft Visual Studio 9.0\VC\include\ctype.h(100) : error C2065: 'SA_No' : undeclared identifier
1> missing quotes ("") around 'SA_No'?
1>C:\Program Files\Microsoft Visual Studio 9.0\VC\include\ctype.h(100) : error C2337: 'SA_Pre' : attribute not found
1>C:\Program Files\Microsoft Visual Studio 9.0\VC\include\ctype.h(100) : error C2065: 'SA_Yes' : undeclared identifier
1> missing quotes ("") around 'SA_Yes'?
1>C:\Program Files\Microsoft Visual Studio 9.0\VC\include\ctype.h(100) : error C2065: 'SA_Read' : undeclared identifier
1> missing quotes ("") around 'SA_Read'?
1>C:\Program Files\Microsoft Visual Studio 9.0\VC\include\ctype.h(101) : error C2337: 'SA_Post' : attribute not found
1>C:\Program Files\Microsoft Visual Studio 9.0\VC\include\ctype.h(101) : error C2065: 'SA_Yes' : undeclared identifier
1>C:\Program Files\Microsoft Visual Studio 9.0\VC\include\ctype.h(101) : fatal error C1003: error count exceeds 100; stopping compilation
1>DirectX.cpp
1>C:\Program Files\Microsoft Visual Studio 9.0\VC\include\excpt.h(60) : error C2337: 'SA_Pre' : attribute not found
1>C:\Program Files\Microsoft Visual Studio 9.0\VC\include\excpt.h(60) : error C2065: 'SA_No' : undeclared identifier
1> missing quotes ("") around 'SA_No'?
1>C:\Program Files\Microsoft Visual Studio 9.0\VC\include\excpt.h(60) : error C2337: 'SA_Pre' : attribute not found
1>C:\Program Files\Microsoft Visual Studio 9.0\VC\include\excpt.h(60) : error C2065: 'SA_Yes' : undeclared identifier
1> missing quotes ("") around 'SA_Yes'?
1>C:\Program Files\Microsoft Visual Studio 9.0\VC\include\excpt.h(60) : error C2065: 'SA_Read' : undeclared identifier
1> missing quotes ("") around 'SA_Read'?
1>C:\Program Files\Microsoft Visual Studio 9.0\VC\include\excpt.h(61) : error C2337: 'SA_Pre' : attribute not found
1>C:\Program Files\Microsoft Visual Studio 9.0\VC\include\excpt.h(61) : error C2065: 'SA_No' : undeclared identifier
1> missing quotes ("") around 'SA_No'?
1>C:\Program Files\Microsoft Visual Studio 9.0\VC\include\excpt.h(61) : error C2337: 'SA_Pre' : attribute not found
1>C:\Program Files\Microsoft Visual Studio 9.0\VC\include\excpt.h(61) : error C2065: 'SA_Yes' : undeclared identifier
1> missing quotes ("") around 'SA_Yes'?
1>C:\Program Files\Microsoft Visual Studio 9.0\VC\include\excpt.h(61) : error C2065: 'SA_Read' : undeclared identifier
1> missing quotes ("") around 'SA_Read'?
1>C:\Program Files\Microsoft Visual Studio 9.0\VC\include\excpt.h(62) : error C2337: 'SA_Pre' : attribute not found
1>C:\Program Files\Microsoft Visual Studio 9.0\VC\include\excpt.h(62) : error C2065: 'SA_No' : undeclared identifier
1> missing quotes ("") around 'SA_No'?
1>C:\Program Files\Microsoft Visual Studio 9.0\VC\include\excpt.h(62) : error C2337: 'SA_Pre' : attribute not found
1>C:\Program Files\Microsoft Visual Studio 9.0\VC\include\excpt.h(62) : error C2065: 'SA_Yes' : undeclared identifier
1> missing quotes ("") around 'SA_Yes'?
1>C:\Program Files\Microsoft Visual Studio 9.0\VC\include\excpt.h(62) : error C2337: 'SA_Post' : attribute not found
1>C:\Program Files\Microsoft Visual Studio 9.0\VC\include\excpt.h(62) : error C2065: 'SA_Yes' : undeclared identifier
1> missing quotes ("") around 'SA_Yes'?
1>C:\Program Files\Microsoft Visual Studio 9.0\VC\include\excpt.h(63) : error C2337: 'SA_Pre' : attribute not found
1>C:\Program Files\Microsoft Visual Studio 9.0\VC\include\excpt.h(63) : error C2065: 'SA_No' : undeclared identifier
1> missing quotes ("") around 'SA_No'?
1>C:\Program Files\Microsoft Visual Studio 9.0\VC\include\excpt.h(63) : error C2337: 'SA_Pre' : attribute not found
1>C:\Program Files\Microsoft Visual Studio 9.0\VC\include\excpt.h(63) : error C2065: 'SA_Yes' : undeclared identifier
1> missing quotes ("") around 'SA_Yes'?
1>C:\Program Files\Microsoft Visual Studio 9.0\VC\include\excpt.h(63) : error C2337: 'SA_Post' : attribute not found
1>C:\Program Files\Microsoft Visual Studio 9.0\VC\include\excpt.h(63) : error C2065: 'SA_Yes' : undeclared identifier
1> missing quotes ("") around 'SA_Yes'?
1>C:\Program Files\Microsoft Visual Studio 9.0\VC\include\ctype.h(94) : error C2337: 'SA_Post' : attribute not found
1>C:\Program Files\Microsoft Visual Studio 9.0\VC\include\ctype.h(94) : error C2065: 'SA_Yes' : undeclared identifier
1> missing quotes ("") around 'SA_Yes'?
1>C:\Program Files\Microsoft Visual Studio 9.0\VC\include\ctype.h(94) : error C2337: 'SA_Pre' : attribute not found
1>C:\Program Files\Microsoft Visual Studio 9.0\VC\include\ctype.h(94) : error C2065: 'SA_No' : undeclared identifier
1> missing quotes ("") around 'SA_No'?
1>C:\Program Files\Microsoft Visual Studio 9.0\VC\include\ctype.h(94) : error C2337: 'SA_Pre' : attribute not found
1>C:\Program Files\Microsoft Visual Studio 9.0\VC\include\ctype.h(94) : error C2065: 'SA_Yes' : undeclared identifier
1> missing quotes ("") around 'SA_Yes'?
1>C:\Program Files\Microsoft Visual Studio 9.0\VC\include\ctype.h(94) : error C2065: 'SA_Read' : undeclared identifier
1> missing quotes ("") around 'SA_Read'?
1>C:\Program Files\Microsoft Visual Studio 9.0\VC\include\ctype.h(94) : error C2337: 'SA_Pre' : attribute not found
1>C:\Program Files\Microsoft Visual Studio 9.0\VC\include\ctype.h(94) : error C2065: 'SA_No' : undeclared identifier
1> missing quotes ("") around 'SA_No'?
1>C:\Program Files\Microsoft Visual Studio 9.0\VC\include\ctype.h(94) : error C2337: 'SA_Pre' : attribute not found
1>C:\Program Files\Microsoft Visual Studio 9.0\VC\include\ctype.h(94) : error C2065: 'SA_Yes' : undeclared identifier
1> missing quotes ("") around 'SA_Yes'?
1>C:\Program Files\Microsoft Visual Studio 9.0\VC\include\ctype.h(94) : error C2065: 'SA_Read' : undeclared identifier
1> missing quotes ("") around 'SA_Read'?
1>C:\Program Files\Microsoft Visual Studio 9.0\VC\include\ctype.h(95) : error C2337: 'SA_Post' : attribute not found
1>C:\Program Files\Microsoft Visual Studio 9.0\VC\include\ctype.h(95) : error C2065: 'SA_Yes' : undeclared identifier
1> missing quotes ("") around 'SA_Yes'?
1>C:\Program Files\Microsoft Visual Studio 9.0\VC\include\ctype.h(95) : error C2337: 'SA_Pre' : attribute not found
1>C:\Program Files\Microsoft Visual Studio 9.0\VC\include\ctype.h(95) : error C2065: 'SA_No' : undeclared identifier
1> missing quotes ("") around 'SA_No'?
1>C:\Program Files\Microsoft Visual Studio 9.0\VC\include\ctype.h(95) : error C2337: 'SA_Pre' : attribute not found
1>C:\Program Files\Microsoft Visual Studio 9.0\VC\include\ctype.h(95) : error C2065: 'SA_Yes' : undeclared identifier
1> missing quotes ("") around 'SA_Yes'?
1>C:\Program Files\Microsoft Visual Studio 9.0\VC\include\ctype.h(95) : error C2065: 'SA_Read' : undeclared identifier
1> missing quotes ("") around 'SA_Read'?
1>C:\Program Files\Microsoft Visual Studio 9.0\VC\include\ctype.h(95) : error C2337: 'SA_Pre' : attribute not found
1>C:\Program Files\Microsoft Visual Studio 9.0\VC\include\ctype.h(95) : error C2065: 'SA_No' : undeclared identifier
1> missing quotes ("") around 'SA_No'?
1>C:\Program Files\Microsoft Visual Studio 9.0\VC\include\ctype.h(95) : error C2337: 'SA_Pre' : attribute not found
1>C:\Program Files\Microsoft Visual Studio 9.0\VC\include\ctype.h(95) : error C2065: 'SA_Yes' : undeclared identifier
1> missing quotes ("") around 'SA_Yes'?
1>C:\Program Files\Microsoft Visual Studio 9.0\VC\include\ctype.h(95) : error C2065: 'SA_Read' : undeclared identifier
1> missing quotes ("") around 'SA_Read'?
1>C:\Program Files\Microsoft Visual Studio 9.0\VC\include\ctype.h(95) : error C2337: 'SA_Pre' : attribute not found
1>C:\Program Files\Microsoft Visual Studio 9.0\VC\include\ctype.h(95) : error C2065: 'SA_Maybe' : undeclared identifier
1> missing quotes ("") around 'SA_Maybe'?
1>C:\Program Files\Microsoft Visual Studio 9.0\VC\include\ctype.h(95) : error C2337: 'SA_Pre' : attribute not found
1>C:\Program Files\Microsoft Visual Studio 9.0\VC\include\ctype.h(95) : error C2065: 'SA_Yes' : undeclared identifier
1> missing quotes ("") around 'SA_Yes'?
1>C:\Program Files\Microsoft Visual Studio 9.0\VC\include\ctype.h(95) : error C2337: 'SA_Pre' : attribute not found
1>C:\Program Files\Microsoft Visual Studio 9.0\VC\include\ctype.h(95) : error C2065: 'SA_Read' : undeclared identifier
1> missing quotes ("") around 'SA_Read'?
1>C:\Program Files\Microsoft Visual Studio 9.0\VC\include\ctype.h(96) : error C2337: 'SA_Post' : attribute not found
1>C:\Program Files\Microsoft Visual Studio 9.0\VC\include\ctype.h(96) : error C2065: 'SA_Yes' : undeclared identifier
1> missing quotes ("") around 'SA_Yes'?
1>C:\Program Files\Microsoft Visual Studio 9.0\VC\include\ctype.h(96) : error C2337: 'SA_Pre' : attribute not found
1>C:\Program Files\Microsoft Visual Studio 9.0\VC\include\ctype.h(96) : error C2065: 'SA_No' : undeclared identifier
1> missing quotes ("") around 'SA_No'?
1>C:\Program Files\Microsoft Visual Studio 9.0\VC\include\ctype.h(96) : error C2337: 'SA_Pre' : attribute not found
1>C:\Program Files\Microsoft Visual Studio 9.0\VC\include\ctype.h(96) : error C2065: 'SA_Yes' : undeclared identifier
1> missing quotes ("") around 'SA_Yes'?
1>C:\Program Files\Microsoft Visual Studio 9.0\VC\include\ctype.h(96) : error C2065: 'SA_Read' : undeclared identifier
1> missing quotes ("") around 'SA_Read'?
1>C:\Program Files\Microsoft Visual Studio 9.0\VC\include\ctype.h(97) : error C2337: 'SA_Post' : attribute not found
1>C:\Program Files\Microsoft Visual Studio 9.0\VC\include\ctype.h(97) : error C2065: 'SA_Yes' : undeclared identifier
1> missing quotes ("") around 'SA_Yes'?
1>C:\Program Files\Microsoft Visual Studio 9.0\VC\include\ctype.h(97) : error C2337: 'SA_Pre' : attribute not found
1>C:\Program Files\Microsoft Visual Studio 9.0\VC\include\ctype.h(97) : error C2065: 'SA_No' : undeclared identifier
1> missing quotes ("") around 'SA_No'?
1>C:\Program Files\Microsoft Visual Studio 9.0\VC\include\ctype.h(97) : error C2337: 'SA_Pre' : attribute not found
1>C:\Program Files\Microsoft Visual Studio 9.0\VC\include\ctype.h(97) : error C2065: 'SA_Yes' : undeclared identifier
1> missing quotes ("") around 'SA_Yes'?
1>C:\Program Files\Microsoft Visual Studio 9.0\VC\include\ctype.h(97) : error C2065: 'SA_Read' : undeclared identifier
1> missing quotes ("") around 'SA_Read'?
1>C:\Program Files\Microsoft Visual Studio 9.0\VC\include\ctype.h(97) : error C2337: 'SA_Pre' : attribute not found
1>C:\Program Files\Microsoft Visual Studio 9.0\VC\include\ctype.h(97) : error C2065: 'SA_Maybe' : undeclared identifier
1> missing quotes ("") around 'SA_Maybe'?
1>C:\Program Files\Microsoft Visual Studio 9.0\VC\include\ctype.h(97) : error C2337: 'SA_Pre' : attribute not found
1>C:\Program Files\Microsoft Visual Studio 9.0\VC\include\ctype.h(97) : error C2065: 'SA_Yes' : undeclared identifier
1> missing quotes ("") around 'SA_Yes'?
1>C:\Program Files\Microsoft Visual Studio 9.0\VC\include\ctype.h(97) : error C2337: 'SA_Pre' : attribute not found
1>C:\Program Files\Microsoft Visual Studio 9.0\VC\include\ctype.h(97) : error C2065: 'SA_Read' : undeclared identifier
1> missing quotes ("") around 'SA_Read'?
1>C:\Program Files\Microsoft Visual Studio 9.0\VC\include\ctype.h(98) : error C2337: 'SA_Post' : attribute not found
1>C:\Program Files\Microsoft Visual Studio 9.0\VC\include\ctype.h(98) : error C2065: 'SA_Yes' : undeclared identifier
1> missing quotes ("") around 'SA_Yes'?
1>C:\Program Files\Microsoft Visual Studio 9.0\VC\include\ctype.h(98) : error C2337: 'SA_Pre' : attribute not found
1>C:\Program Files\Microsoft Visual Studio 9.0\VC\include\ctype.h(98) : error C2065: 'SA_No' : undeclared identifier
1> missing quotes ("") around 'SA_No'?
1>C:\Program Files\Microsoft Visual Studio 9.0\VC\include\ctype.h(98) : error C2337: 'SA_Pre' : attribute not found
1>C:\Program Files\Microsoft Visual Studio 9.0\VC\include\ctype.h(98) : error C2065: 'SA_Yes' : undeclared identifier
1> missing quotes ("") around 'SA_Yes'?
1>C:\Program Files\Microsoft Visual Studio 9.0\VC\include\ctype.h(98) : error C2065: 'SA_Read' : undeclared identifier
1> missing quotes ("") around 'SA_Read'?
1>C:\Program Files\Microsoft Visual Studio 9.0\VC\include\ctype.h(99) : error C2337: 'SA_Post' : attribute not found
1>C:\Program Files\Microsoft Visual Studio 9.0\VC\include\ctype.h(99) : error C2065: 'SA_Yes' : undeclared identifier
1> missing quotes ("") around 'SA_Yes'?
1>C:\Program Files\Microsoft Visual Studio 9.0\VC\include\ctype.h(99) : error C2337: 'SA_Pre' : attribute not found
1>C:\Program Files\Microsoft Visual Studio 9.0\VC\include\ctype.h(99) : error C2065: 'SA_No' : undeclared identifier
1> missing quotes ("") around 'SA_No'?
1>C:\Program Files\Microsoft Visual Studio 9.0\VC\include\ctype.h(99) : error C2337: 'SA_Pre' : attribute not found
1>C:\Program Files\Microsoft Visual Studio 9.0\VC\include\ctype.h(99) : error C2065: 'SA_Yes' : undeclared identifier
1> missing quotes ("") around 'SA_Yes'?
1>C:\Program Files\Microsoft Visual Studio 9.0\VC\include\ctype.h(99) : error C2065: 'SA_Read' : undeclared identifier
1> missing quotes ("") around 'SA_Read'?
1>C:\Program Files\Microsoft Visual Studio 9.0\VC\include\ctype.h(99) : error C2337: 'SA_Pre' : attribute not found
1>C:\Program Files\Microsoft Visual Studio 9.0\VC\include\ctype.h(99) : error C2065: 'SA_Maybe' : undeclared identifier
1> missing quotes ("") around 'SA_Maybe'?
1>C:\Program Files\Microsoft Visual Studio 9.0\VC\include\ctype.h(99) : error C2337: 'SA_Pre' : attribute not found
1>C:\Program Files\Microsoft Visual Studio 9.0\VC\include\ctype.h(99) : error C2065: 'SA_Yes' : undeclared identifier
1> missing quotes ("") around 'SA_Yes'?
1>C:\Program Files\Microsoft Visual Studio 9.0\VC\include\ctype.h(99) : error C2337: 'SA_Pre' : attribute not found
1>C:\Program Files\Microsoft Visual Studio 9.0\VC\include\ctype.h(99) : error C2065: 'SA_Read' : undeclared identifier
1> missing quotes ("") around 'SA_Read'?
1>C:\Program Files\Microsoft Visual Studio 9.0\VC\include\ctype.h(100) : error C2337: 'SA_Post' : attribute not found
1>C:\Program Files\Microsoft Visual Studio 9.0\VC\include\ctype.h(100) : error C2065: 'SA_Yes' : undeclared identifier
1> missing quotes ("") around 'SA_Yes'?
1>C:\Program Files\Microsoft Visual Studio 9.0\VC\include\ctype.h(100) : error C2337: 'SA_Pre' : attribute not found
1>C:\Program Files\Microsoft Visual Studio 9.0\VC\include\ctype.h(100) : error C2065: 'SA_No' : undeclared identifier
1> missing quotes ("") around 'SA_No'?
1>C:\Program Files\Microsoft Visual Studio 9.0\VC\include\ctype.h(100) : error C2337: 'SA_Pre' : attribute not found
1>C:\Program Files\Microsoft Visual Studio 9.0\VC\include\ctype.h(100) : error C2065: 'SA_Yes' : undeclared identifier
1> missing quotes ("") around 'SA_Yes'?
1>C:\Program Files\Microsoft Visual Studio 9.0\VC\include\ctype.h(100) : error C2065: 'SA_Read' : undeclared identifier
1> missing quotes ("") around 'SA_Read'?
1>C:\Program Files\Microsoft Visual Studio 9.0\VC\include\ctype.h(101) : error C2337: 'SA_Post' : attribute not found
1>C:\Program Files\Microsoft Visual Studio 9.0\VC\include\ctype.h(101) : error C2065: 'SA_Yes' : undeclared identifier
1>C:\Program Files\Microsoft Visual Studio 9.0\VC\include\ctype.h(101) : fatal error C1003: error count exceeds 100; stopping compilation
1>detours.cpp
1>C:\Program Files\Microsoft Visual Studio 9.0\VC\include\excpt.h(60) : error C2337: 'SA_Pre' : attribute not found
1>C:\Program Files\Microsoft Visual Studio 9.0\VC\include\excpt.h(60) : error C2065: 'SA_No' : undeclared identifier
1> missing quotes ("") around 'SA_No'?
1>C:\Program Files\Microsoft Visual Studio 9.0\VC\include\excpt.h(60) : error C2337: 'SA_Pre' : attribute not found
1>C:\Program Files\Microsoft Visual Studio 9.0\VC\include\excpt.h(60) : error C2065: 'SA_Yes' : undeclared identifier
1> missing quotes ("") around 'SA_Yes'?
1>C:\Program Files\Microsoft Visual Studio 9.0\VC\include\excpt.h(60) : error C2065: 'SA_Read' : undeclared identifier
1> missing quotes ("") around 'SA_Read'?
1>C:\Program Files\Microsoft Visual Studio 9.0\VC\include\excpt.h(61) : error C2337: 'SA_Pre' : attribute not found
1>C:\Program Files\Microsoft Visual Studio 9.0\VC\include\excpt.h(61) : error C2065: 'SA_No' : undeclared identifier
1> missing quotes ("") around 'SA_No'?
1>C:\Program Files\Microsoft Visual Studio 9.0\VC\include\excpt.h(61) : error C2337: 'SA_Pre' : attribute not found
1>C:\Program Files\Microsoft Visual Studio 9.0\VC\include\excpt.h(61) : error C2065: 'SA_Yes' : undeclared identifier
1> missing quotes ("") around 'SA_Yes'?
1>C:\Program Files\Microsoft Visual Studio 9.0\VC\include\excpt.h(61) : error C2065: 'SA_Read' : undeclared identifier
1> missing quotes ("") around 'SA_Read'?
1>C:\Program Files\Microsoft Visual Studio 9.0\VC\include\excpt.h(62) : error C2337: 'SA_Pre' : attribute not found
1>C:\Program Files\Microsoft Visual Studio 9.0\VC\include\excpt.h(62) : error C2065: 'SA_No' : undeclared identifier
1> missing quotes ("") around 'SA_No'?
1>C:\Program Files\Microsoft Visual Studio 9.0\VC\include\excpt.h(62) : error C2337: 'SA_Pre' : attribute not found
1>C:\Program Files\Microsoft Visual Studio 9.0\VC\include\excpt.h(62) : error C2065: 'SA_Yes' : undeclared identifier
1> missing quotes ("") around 'SA_Yes'?
1>C:\Program Files\Microsoft Visual Studio 9.0\VC\include\excpt.h(62) : error C2337: 'SA_Post' : attribute not found
1>C:\Program Files\Microsoft Visual Studio 9.0\VC\include\excpt.h(62) : error C2065: 'SA_Yes' : undeclared identifier
1> missing quotes ("") around 'SA_Yes'?
1>C:\Program Files\Microsoft Visual Studio 9.0\VC\include\excpt.h(63) : error C2337: 'SA_Pre' : attribute not found
1>C:\Program Files\Microsoft Visual Studio 9.0\VC\include\excpt.h(63) : error C2065: 'SA_No' : undeclared identifier
1> missing quotes ("") around 'SA_No'?
1>C:\Program Files\Microsoft Visual Studio 9.0\VC\include\excpt.h(63) : error C2337: 'SA_Pre' : attribute not found
1>C:\Program Files\Microsoft Visual Studio 9.0\VC\include\excpt.h(63) : error C2065: 'SA_Yes' : undeclared identifier
1> missing quotes ("") around 'SA_Yes'?
1>C:\Program Files\Microsoft Visual Studio 9.0\VC\include\excpt.h(63) : error C2337: 'SA_Post' : attribute not found
1>C:\Program Files\Microsoft Visual Studio 9.0\VC\include\excpt.h(63) : error C2065: 'SA_Yes' : undeclared identifier
1> missing quotes ("") around 'SA_Yes'?
1>C:\Program Files\Microsoft Visual Studio 9.0\VC\include\ctype.h(94) : error C2337: 'SA_Post' : attribute not found
1>C:\Program Files\Microsoft Visual Studio 9.0\VC\include\ctype.h(94) : error C2065: 'SA_Yes' : undeclared identifier
1> missing quotes ("") around 'SA_Yes'?
1>C:\Program Files\Microsoft Visual Studio 9.0\VC\include\ctype.h(94) : error C2337: 'SA_Pre' : attribute not found
1>C:\Program Files\Microsoft Visual Studio 9.0\VC\include\ctype.h(94) : error C2065: 'SA_No' : undeclared identifier
1> missing quotes ("") around 'SA_No'?
1>C:\Program Files\Microsoft Visual Studio 9.0\VC\include\ctype.h(94) : error C2337: 'SA_Pre' : attribute not found
1>C:\Program Files\Microsoft Visual Studio 9.0\VC\include\ctype.h(94) : error C2065: 'SA_Yes' : undeclared identifier
1> missing quotes ("") around 'SA_Yes'?
1>C:\Program Files\Microsoft Visual Studio 9.0\VC\include\ctype.h(94) : error C2065: 'SA_Read' : undeclared identifier
1> missing quotes ("") around 'SA_Read'?
1>C:\Program Files\Microsoft Visual Studio 9.0\VC\include\ctype.h(94) : error C2337: 'SA_Pre' : attribute not found
1>C:\Program Files\Microsoft Visual Studio 9.0\VC\include\ctype.h(94) : error C2065: 'SA_No' : undeclared identifier
1> missing quotes ("") around 'SA_No'?
1>C:\Program Files\Microsoft Visual Studio 9.0\VC\include\ctype.h(94) : error C2337: 'SA_Pre' : attribute not found
1>C:\Program Files\Microsoft Visual Studio 9.0\VC\include\ctype.h(94) : error C2065: 'SA_Yes' : undeclared identifier
1> missing quotes ("") around 'SA_Yes'?
1>C:\Program Files\Microsoft Visual Studio 9.0\VC\include\ctype.h(94) : error C2065: 'SA_Read' : undeclared identifier
1> missing quotes ("") around 'SA_Read'?
1>C:\Program Files\Microsoft Visual Studio 9.0\VC\include\ctype.h(95) : error C2337: 'SA_Post' : attribute not found
1>C:\Program Files\Microsoft Visual Studio 9.0\VC\include\ctype.h(95) : error C2065: 'SA_Yes' : undeclared identifier
1> missing quotes ("") around 'SA_Yes'?
1>C:\Program Files\Microsoft Visual Studio 9.0\VC\include\ctype.h(95) : error C2337: 'SA_Pre' : attribute not found
1>C:\Program Files\Microsoft Visual Studio 9.0\VC\include\ctype.h(95) : error C2065: 'SA_No' : undeclared identifier
1> missing quotes ("") around 'SA_No'?
1>C:\Program Files\Microsoft Visual Studio 9.0\VC\include\ctype.h(95) : error C2337: 'SA_Pre' : attribute not found
1>C:\Program Files\Microsoft Visual Studio 9.0\VC\include\ctype.h(95) : error C2065: 'SA_Yes' : undeclared identifier
1> missing quotes ("") around 'SA_Yes'?
1>C:\Program Files\Microsoft Visual Studio 9.0\VC\include\ctype.h(95) : error C2065: 'SA_Read' : undeclared identifier
1> missing quotes ("") around 'SA_Read'?
1>C:\Program Files\Microsoft Visual Studio 9.0\VC\include\ctype.h(95) : error C2337: 'SA_Pre' : attribute not found
1>C:\Program Files\Microsoft Visual Studio 9.0\VC\include\ctype.h(95) : error C2065: 'SA_No' : undeclared identifier
1> missing quotes ("") around 'SA_No'?
1>C:\Program Files\Microsoft Visual Studio 9.0\VC\include\ctype.h(95) : error C2337: 'SA_Pre' : attribute not found
1>C:\Program Files\Microsoft Visual Studio 9.0\VC\include\ctype.h(95) : error C2065: 'SA_Yes' : undeclared identifier
1> missing quotes ("") around 'SA_Yes'?
1>C:\Program Files\Microsoft Visual Studio 9.0\VC\include\ctype.h(95) : error C2065: 'SA_Read' : undeclared identifier
1> missing quotes ("") around 'SA_Read'?
1>C:\Program Files\Microsoft Visual Studio 9.0\VC\include\ctype.h(95) : error C2337: 'SA_Pre' : attribute not found
1>C:\Program Files\Microsoft Visual Studio 9.0\VC\include\ctype.h(95) : error C2065: 'SA_Maybe' : undeclared identifier
1> missing quotes ("") around 'SA_Maybe'?
1>C:\Program Files\Microsoft Visual Studio 9.0\VC\include\ctype.h(95) : error C2337: 'SA_Pre' : attribute not found
1>C:\Program Files\Microsoft Visual Studio 9.0\VC\include\ctype.h(95) : error C2065: 'SA_Yes' : undeclared identifier
1> missing quotes ("") around 'SA_Yes'?
1>C:\Program Files\Microsoft Visual Studio 9.0\VC\include\ctype.h(95) : error C2337: 'SA_Pre' : attribute not found
1>C:\Program Files\Microsoft Visual Studio 9.0\VC\include\ctype.h(95) : error C2065: 'SA_Read' : undeclared identifier
1> missing quotes ("") around 'SA_Read'?
1>C:\Program Files\Microsoft Visual Studio 9.0\VC\include\ctype.h(96) : error C2337: 'SA_Post' : attribute not found
1>C:\Program Files\Microsoft Visual Studio 9.0\VC\include\ctype.h(96) : error C2065: 'SA_Yes' : undeclared identifier
1> missing quotes ("") around 'SA_Yes'?
1>C:\Program Files\Microsoft Visual Studio 9.0\VC\include\ctype.h(96) : error C2337: 'SA_Pre' : attribute not found
1>C:\Program Files\Microsoft Visual Studio 9.0\VC\include\ctype.h(96) : error C2065: 'SA_No' : undeclared identifier
1> missing quotes ("") around 'SA_No'?
1>C:\Program Files\Microsoft Visual Studio 9.0\VC\include\ctype.h(96) : error C2337: 'SA_Pre' : attribute not found
1>C:\Program Files\Microsoft Visual Studio 9.0\VC\include\ctype.h(96) : error C2065: 'SA_Yes' : undeclared identifier
1> missing quotes ("") around 'SA_Yes'?
1>C:\Program Files\Microsoft Visual Studio 9.0\VC\include\ctype.h(96) : error C2065: 'SA_Read' : undeclared identifier
1> missing quotes ("") around 'SA_Read'?
1>C:\Program Files\Microsoft Visual Studio 9.0\VC\include\ctype.h(97) : error C2337: 'SA_Post' : attribute not found
1>C:\Program Files\Microsoft Visual Studio 9.0\VC\include\ctype.h(97) : error C2065: 'SA_Yes' : undeclared identifier
1> missing quotes ("") around 'SA_Yes'?
1>C:\Program Files\Microsoft Visual Studio 9.0\VC\include\ctype.h(97) : error C2337: 'SA_Pre' : attribute not found
1>C:\Program Files\Microsoft Visual Studio 9.0\VC\include\ctype.h(97) : error C2065: 'SA_No' : undeclared identifier
1> missing quotes ("") around 'SA_No'?
1>C:\Program Files\Microsoft Visual Studio 9.0\VC\include\ctype.h(97) : error C2337: 'SA_Pre' : attribute not found
1>C:\Program Files\Microsoft Visual Studio 9.0\VC\include\ctype.h(97) : error C2065: 'SA_Yes' : undeclared identifier
1> missing quotes ("") around 'SA_Yes'?
1>C:\Program Files\Microsoft Visual Studio 9.0\VC\include\ctype.h(97) : error C2065: 'SA_Read' : undeclared identifier
1> missing quotes ("") around 'SA_Read'?
1>C:\Program Files\Microsoft Visual Studio 9.0\VC\include\ctype.h(97) : error C2337: 'SA_Pre' : attribute not found
1>C:\Program Files\Microsoft Visual Studio 9.0\VC\include\ctype.h(97) : error C2065: 'SA_Maybe' : undeclared identifier
1> missing quotes ("") around 'SA_Maybe'?
1>C:\Program Files\Microsoft Visual Studio 9.0\VC\include\ctype.h(97) : error C2337: 'SA_Pre' : attribute not found
1>C:\Program Files\Microsoft Visual Studio 9.0\VC\include\ctype.h(97) : error C2065: 'SA_Yes' : undeclared identifier
1> missing quotes ("") around 'SA_Yes'?
1>C:\Program Files\Microsoft Visual Studio 9.0\VC\include\ctype.h(97) : error C2337: 'SA_Pre' : attribute not found
1>C:\Program Files\Microsoft Visual Studio 9.0\VC\include\ctype.h(97) : error C2065: 'SA_Read' : undeclared identifier
1> missing quotes ("") around 'SA_Read'?
1>C:\Program Files\Microsoft Visual Studio 9.0\VC\include\ctype.h(98) : error C2337: 'SA_Post' : attribute not found
1>C:\Program Files\Microsoft Visual Studio 9.0\VC\include\ctype.h(98) : error C2065: 'SA_Yes' : undeclared identifier
1> missing quotes ("") around 'SA_Yes'?
1>C:\Program Files\Microsoft Visual Studio 9.0\VC\include\ctype.h(98) : error C2337: 'SA_Pre' : attribute not found
1>C:\Program Files\Microsoft Visual Studio 9.0\VC\include\ctype.h(98) : error C2065: 'SA_No' : undeclared identifier
1> missing quotes ("") around 'SA_No'?
1>C:\Program Files\Microsoft Visual Studio 9.0\VC\include\ctype.h(98) : error C2337: 'SA_Pre' : attribute not found
1>C:\Program Files\Microsoft Visual Studio 9.0\VC\include\ctype.h(98) : error C2065: 'SA_Yes' : undeclared identifier
1> missing quotes ("") around 'SA_Yes'?
1>C:\Program Files\Microsoft Visual Studio 9.0\VC\include\ctype.h(98) : error C2065: 'SA_Read' : undeclared identifier
1> missing quotes ("") around 'SA_Read'?
1>C:\Program Files\Microsoft Visual Studio 9.0\VC\include\ctype.h(99) : error C2337: 'SA_Post' : attribute not found
1>C:\Program Files\Microsoft Visual Studio 9.0\VC\include\ctype.h(99) : error C2065: 'SA_Yes' : undeclared identifier
1> missing quotes ("") around 'SA_Yes'?
1>C:\Program Files\Microsoft Visual Studio 9.0\VC\include\ctype.h(99) : error C2337: 'SA_Pre' : attribute not found
1>C:\Program Files\Microsoft Visual Studio 9.0\VC\include\ctype.h(99) : error C2065: 'SA_No' : undeclared identifier
1> missing quotes ("") around 'SA_No'?
1>C:\Program Files\Microsoft Visual Studio 9.0\VC\include\ctype.h(99) : error C2337: 'SA_Pre' : attribute not found
1>C:\Program Files\Microsoft Visual Studio 9.0\VC\include\ctype.h(99) : error C2065: 'SA_Yes' : undeclared identifier
1> missing quotes ("") around 'SA_Yes'?
1>C:\Program Files\Microsoft Visual Studio 9.0\VC\include\ctype.h(99) : error C2065: 'SA_Read' : undeclared identifier
1> missing quotes ("") around 'SA_Read'?
1>C:\Program Files\Microsoft Visual Studio 9.0\VC\include\ctype.h(99) : error C2337: 'SA_Pre' : attribute not found
1>C:\Program Files\Microsoft Visual Studio 9.0\VC\include\ctype.h(99) : error C2065: 'SA_Maybe' : undeclared identifier
1> missing quotes ("") around 'SA_Maybe'?
1>C:\Program Files\Microsoft Visual Studio 9.0\VC\include\ctype.h(99) : error C2337: 'SA_Pre' : attribute not found
1>C:\Program Files\Microsoft Visual Studio 9.0\VC\include\ctype.h(99) : error C2065: 'SA_Yes' : undeclared identifier
1> missing quotes ("") around 'SA_Yes'?
1>C:\Program Files\Microsoft Visual Studio 9.0\VC\include\ctype.h(99) : error C2337: 'SA_Pre' : attribute not found
1>C:\Program Files\Microsoft Visual Studio 9.0\VC\include\ctype.h(99) : error C2065: 'SA_Read' : undeclared identifier
1> missing quotes ("") around 'SA_Read'?
1>C:\Program Files\Microsoft Visual Studio 9.0\VC\include\ctype.h(100) : error C2337: 'SA_Post' : attribute not found
1>C:\Program Files\Microsoft Visual Studio 9.0\VC\include\ctype.h(100) : error C2065: 'SA_Yes' : undeclared identifier
1> missing quotes ("") around 'SA_Yes'?
1>C:\Program Files\Microsoft Visual Studio 9.0\VC\include\ctype.h(100) : error C2337: 'SA_Pre' : attribute not found
1>C:\Program Files\Microsoft Visual Studio 9.0\VC\include\ctype.h(100) : error C2065: 'SA_No' : undeclared identifier
1> missing quotes ("") around 'SA_No'?
1>C:\Program Files\Microsoft Visual Studio 9.0\VC\include\ctype.h(100) : error C2337: 'SA_Pre' : attribute not found
1>C:\Program Files\Microsoft Visual Studio 9.0\VC\include\ctype.h(100) : error C2065: 'SA_Yes' : undeclared identifier
1> missing quotes ("") around 'SA_Yes'?
1>C:\Program Files\Microsoft Visual Studio 9.0\VC\include\ctype.h(100) : error C2065: 'SA_Read' : undeclared identifier
1> missing quotes ("") around 'SA_Read'?
1>C:\Program Files\Microsoft Visual Studio 9.0\VC\include\ctype.h(101) : error C2337: 'SA_Post' : attribute not found
1>C:\Program Files\Microsoft Visual Studio 9.0\VC\include\ctype.h(101) : error C2065: 'SA_Yes' : undeclared identifier
1>C:\Program Files\Microsoft Visual Studio 9.0\VC\include\ctype.h(101) : fatal error C1003: error count exceeds 100; stopping compilation
1>Base.cpp
1>C:\Program Files\Microsoft Visual Studio 9.0\VC\include\excpt.h(60) : error C2337: 'SA_Pre' : attribute not found
1>C:\Program Files\Microsoft Visual Studio 9.0\VC\include\excpt.h(60) : error C2065: 'SA_No' : undeclared identifier
1> missing quotes ("") around 'SA_No'?
1>C:\Program Files\Microsoft Visual Studio 9.0\VC\include\excpt.h(60) : error C2337: 'SA_Pre' : attribute not found
1>C:\Program Files\Microsoft Visual Studio 9.0\VC\include\excpt.h(60) : error C2065: 'SA_Yes' : undeclared identifier
1> missing quotes ("") around 'SA_Yes'?
1>C:\Program Files\Microsoft Visual Studio 9.0\VC\include\excpt.h(60) : error C2065: 'SA_Read' : undeclared identifier
1> missing quotes ("") around 'SA_Read'?
1>C:\Program Files\Microsoft Visual Studio 9.0\VC\include\excpt.h(61) : error C2337: 'SA_Pre' : attribute not found
1>C:\Program Files\Microsoft Visual Studio 9.0\VC\include\excpt.h(61) : error C2065: 'SA_No' : undeclared identifier
1> missing quotes ("") around 'SA_No'?
1>C:\Program Files\Microsoft Visual Studio 9.0\VC\include\excpt.h(61) : error C2337: 'SA_Pre' : attribute not found
1>C:\Program Files\Microsoft Visual Studio 9.0\VC\include\excpt.h(61) : error C2065: 'SA_Yes' : undeclared identifier
1> missing quotes ("") around 'SA_Yes'?
1>C:\Program Files\Microsoft Visual Studio 9.0\VC\include\excpt.h(61) : error C2065: 'SA_Read' : undeclared identifier
1> missing quotes ("") around 'SA_Read'?
1>C:\Program Files\Microsoft Visual Studio 9.0\VC\include\excpt.h(62) : error C2337: 'SA_Pre' : attribute not found
1>C:\Program Files\Microsoft Visual Studio 9.0\VC\include\excpt.h(62) : error C2065: 'SA_No' : undeclared identifier
1> missing quotes ("") around 'SA_No'?
1>C:\Program Files\Microsoft Visual Studio 9.0\VC\include\excpt.h(62) : error C2337: 'SA_Pre' : attribute not found
1>C:\Program Files\Microsoft Visual Studio 9.0\VC\include\excpt.h(62) : error C2065: 'SA_Yes' : undeclared identifier
1> missing quotes ("") around 'SA_Yes'?
1>C:\Program Files\Microsoft Visual Studio 9.0\VC\include\excpt.h(62) : error C2337: 'SA_Post' : attribute not found
1>C:\Program Files\Microsoft Visual Studio 9.0\VC\include\excpt.h(62) : error C2065: 'SA_Yes' : undeclared identifier
1> missing quotes ("") around 'SA_Yes'?
1>C:\Program Files\Microsoft Visual Studio 9.0\VC\include\excpt.h(63) : error C2337: 'SA_Pre' : attribute not found
1>C:\Program Files\Microsoft Visual Studio 9.0\VC\include\excpt.h(63) : error C2065: 'SA_No' : undeclared identifier
1> missing quotes ("") around 'SA_No'?
1>C:\Program Files\Microsoft Visual Studio 9.0\VC\include\excpt.h(63) : error C2337: 'SA_Pre' : attribute not found
1>C:\Program Files\Microsoft Visual Studio 9.0\VC\include\excpt.h(63) : error C2065: 'SA_Yes' : undeclared identifier
1> missing quotes ("") around 'SA_Yes'?
1>C:\Program Files\Microsoft Visual Studio 9.0\VC\include\excpt.h(63) : error C2337: 'SA_Post' : attribute not found
1>C:\Program Files\Microsoft Visual Studio 9.0\VC\include\excpt.h(63) : error C2065: 'SA_Yes' : undeclared identifier
1> missing quotes ("") around 'SA_Yes'?
1>C:\Program Files\Microsoft Visual Studio 9.0\VC\include\ctype.h(94) : error C2337: 'SA_Post' : attribute not found
1>C:\Program Files\Microsoft Visual Studio 9.0\VC\include\ctype.h(94) : error C2065: 'SA_Yes' : undeclared identifier
1> missing quotes ("") around 'SA_Yes'?
1>C:\Program Files\Microsoft Visual Studio 9.0\VC\include\ctype.h(94) : error C2337: 'SA_Pre' : attribute not found
1>C:\Program Files\Microsoft Visual Studio 9.0\VC\include\ctype.h(94) : error C2065: 'SA_No' : undeclared identifier
1> missing quotes ("") around 'SA_No'?
1>C:\Program Files\Microsoft Visual Studio 9.0\VC\include\ctype.h(94) : error C2337: 'SA_Pre' : attribute not found
1>C:\Program Files\Microsoft Visual Studio 9.0\VC\include\ctype.h(94) : error C2065: 'SA_Yes' : undeclared identifier
1> missing quotes ("") around 'SA_Yes'?
1>C:\Program Files\Microsoft Visual Studio 9.0\VC\include\ctype.h(94) : error C2065: 'SA_Read' : undeclared identifier
1> missing quotes ("") around 'SA_Read'?
1>C:\Program Files\Microsoft Visual Studio 9.0\VC\include\ctype.h(94) : error C2337: 'SA_Pre' : attribute not found
1>C:\Program Files\Microsoft Visual Studio 9.0\VC\include\ctype.h(94) : error C2065: 'SA_No' : undeclared identifier
1> missing quotes ("") around 'SA_No'?
1>C:\Program Files\Microsoft Visual Studio 9.0\VC\include\ctype.h(94) : error C2337: 'SA_Pre' : attribute not found
1>C:\Program Files\Microsoft Visual Studio 9.0\VC\include\ctype.h(94) : error C2065: 'SA_Yes' : undeclared identifier
1> missing quotes ("") around 'SA_Yes'?
1>C:\Program Files\Microsoft Visual Studio 9.0\VC\include\ctype.h(94) : error C2065: 'SA_Read' : undeclared identifier
1> missing quotes ("") around 'SA_Read'?
1>C:\Program Files\Microsoft Visual Studio 9.0\VC\include\ctype.h(95) : error C2337: 'SA_Post' : attribute not found
1>C:\Program Files\Microsoft Visual Studio 9.0\VC\include\ctype.h(95) : error C2065: 'SA_Yes' : undeclared identifier
1> missing quotes ("") around 'SA_Yes'?
1>C:\Program Files\Microsoft Visual Studio 9.0\VC\include\ctype.h(95) : error C2337: 'SA_Pre' : attribute not found
1>C:\Program Files\Microsoft Visual Studio 9.0\VC\include\ctype.h(95) : error C2065: 'SA_No' : undeclared identifier
1> missing quotes ("") around 'SA_No'?
1>C:\Program Files\Microsoft Visual Studio 9.0\VC\include\ctype.h(95) : error C2337: 'SA_Pre' : attribute not found
1>C:\Program Files\Microsoft Visual Studio 9.0\VC\include\ctype.h(95) : error C2065: 'SA_Yes' : undeclared identifier
1> missing quotes ("") around 'SA_Yes'?
1>C:\Program Files\Microsoft Visual Studio 9.0\VC\include\ctype.h(95) : error C2065: 'SA_Read' : undeclared identifier
1> missing quotes ("") around 'SA_Read'?
1>C:\Program Files\Microsoft Visual Studio 9.0\VC\include\ctype.h(95) : error C2337: 'SA_Pre' : attribute not found
1>C:\Program Files\Microsoft Visual Studio 9.0\VC\include\ctype.h(95) : error C2065: 'SA_No' : undeclared identifier
1> missing quotes ("") around 'SA_No'?
1>C:\Program Files\Microsoft Visual Studio 9.0\VC\include\ctype.h(95) : error C2337: 'SA_Pre' : attribute not found
1>C:\Program Files\Microsoft Visual Studio 9.0\VC\include\ctype.h(95) : error C2065: 'SA_Yes' : undeclared identifier
1> missing quotes ("") around 'SA_Yes'?
1>C:\Program Files\Microsoft Visual Studio 9.0\VC\include\ctype.h(95) : error C2065: 'SA_Read' : undeclared identifier
1> missing quotes ("") around 'SA_Read'?
1>C:\Program Files\Microsoft Visual Studio 9.0\VC\include\ctype.h(95) : error C2337: 'SA_Pre' : attribute not found
1>C:\Program Files\Microsoft Visual Studio 9.0\VC\include\ctype.h(95) : error C2065: 'SA_Maybe' : undeclared identifier
1> missing quotes ("") around 'SA_Maybe'?
1>C:\Program Files\Microsoft Visual Studio 9.0\VC\include\ctype.h(95) : error C2337: 'SA_Pre' : attribute not found
1>C:\Program Files\Microsoft Visual Studio 9.0\VC\include\ctype.h(95) : error C2065: 'SA_Yes' : undeclared identifier
1> missing quotes ("") around 'SA_Yes'?
1>C:\Program Files\Microsoft Visual Studio 9.0\VC\include\ctype.h(95) : error C2337: 'SA_Pre' : attribute not found
1>C:\Program Files\Microsoft Visual Studio 9.0\VC\include\ctype.h(95) : error C2065: 'SA_Read' : undeclared identifier
1> missing quotes ("") around 'SA_Read'?
1>C:\Program Files\Microsoft Visual Studio 9.0\VC\include\ctype.h(96) : error C2337: 'SA_Post' : attribute not found
1>C:\Program Files\Microsoft Visual Studio 9.0\VC\include\ctype.h(96) : error C2065: 'SA_Yes' : undeclared identifier
1> missing quotes ("") around 'SA_Yes'?
1>C:\Program Files\Microsoft Visual Studio 9.0\VC\include\ctype.h(96) : error C2337: 'SA_Pre' : attribute not found
1>C:\Program Files\Microsoft Visual Studio 9.0\VC\include\ctype.h(96) : error C2065: 'SA_No' : undeclared identifier
1> missing quotes ("") around 'SA_No'?
1>C:\Program Files\Microsoft Visual Studio 9.0\VC\include\ctype.h(96) : error C2337: 'SA_Pre' : attribute not found
1>C:\Program Files\Microsoft Visual Studio 9.0\VC\include\ctype.h(96) : error C2065: 'SA_Yes' : undeclared identifier
1> missing quotes ("") around 'SA_Yes'?
1>C:\Program Files\Microsoft Visual Studio 9.0\VC\include\ctype.h(96) : error C2065: 'SA_Read' : undeclared identifier
1> missing quotes ("") around 'SA_Read'?
1>C:\Program Files\Microsoft Visual Studio 9.0\VC\include\ctype.h(97) : error C2337: 'SA_Post' : attribute not found
1>C:\Program Files\Microsoft Visual Studio 9.0\VC\include\ctype.h(97) : error C2065: 'SA_Yes' : undeclared identifier
1> missing quotes ("") around 'SA_Yes'?
1>C:\Program Files\Microsoft Visual Studio 9.0\VC\include\ctype.h(97) : error C2337: 'SA_Pre' : attribute not found
1>C:\Program Files\Microsoft Visual Studio 9.0\VC\include\ctype.h(97) : error C2065: 'SA_No' : undeclared identifier
1> missing quotes ("") around 'SA_No'?
1>C:\Program Files\Microsoft Visual Studio 9.0\VC\include\ctype.h(97) : error C2337: 'SA_Pre' : attribute not found
1>C:\Program Files\Microsoft Visual Studio 9.0\VC\include\ctype.h(97) : error C2065: 'SA_Yes' : undeclared identifier
1> missing quotes ("") around 'SA_Yes'?
1>C:\Program Files\Microsoft Visual Studio 9.0\VC\include\ctype.h(97) : error C2065: 'SA_Read' : undeclared identifier
1> missing quotes ("") around 'SA_Read'?
1>C:\Program Files\Microsoft Visual Studio 9.0\VC\include\ctype.h(97) : error C2337: 'SA_Pre' : attribute not found
1>C:\Program Files\Microsoft Visual Studio 9.0\VC\include\ctype.h(97) : error C2065: 'SA_Maybe' : undeclared identifier
1> missing quotes ("") around 'SA_Maybe'?
1>C:\Program Files\Microsoft Visual Studio 9.0\VC\include\ctype.h(97) : error C2337: 'SA_Pre' : attribute not found
1>C:\Program Files\Microsoft Visual Studio 9.0\VC\include\ctype.h(97) : error C2065: 'SA_Yes' : undeclared identifier
1> missing quotes ("") around 'SA_Yes'?
1>C:\Program Files\Microsoft Visual Studio 9.0\VC\include\ctype.h(97) : error C2337: 'SA_Pre' : attribute not found
1>C:\Program Files\Microsoft Visual Studio 9.0\VC\include\ctype.h(97) : error C2065: 'SA_Read' : undeclared identifier
1> missing quotes ("") around 'SA_Read'?
1>C:\Program Files\Microsoft Visual Studio 9.0\VC\include\ctype.h(98) : error C2337: 'SA_Post' : attribute not found
1>C:\Program Files\Microsoft Visual Studio 9.0\VC\include\ctype.h(98) : error C2065: 'SA_Yes' : undeclared identifier
1> missing quotes ("") around 'SA_Yes'?
1>C:\Program Files\Microsoft Visual Studio 9.0\VC\include\ctype.h(98) : error C2337: 'SA_Pre' : attribute not found
1>C:\Program Files\Microsoft Visual Studio 9.0\VC\include\ctype.h(98) : error C2065: 'SA_No' : undeclared identifier
1> missing quotes ("") around 'SA_No'?
1>C:\Program Files\Microsoft Visual Studio 9.0\VC\include\ctype.h(98) : error C2337: 'SA_Pre' : attribute not found
1>C:\Program Files\Microsoft Visual Studio 9.0\VC\include\ctype.h(98) : error C2065: 'SA_Yes' : undeclared identifier
1> missing quotes ("") around 'SA_Yes'?
1>C:\Program Files\Microsoft Visual Studio 9.0\VC\include\ctype.h(98) : error C2065: 'SA_Read' : undeclared identifier
1> missing quotes ("") around 'SA_Read'?
1>C:\Program Files\Microsoft Visual Studio 9.0\VC\include\ctype.h(99) : error C2337: 'SA_Post' : attribute not found
1>C:\Program Files\Microsoft Visual Studio 9.0\VC\include\ctype.h(99) : error C2065: 'SA_Yes' : undeclared identifier
1> missing quotes ("") around 'SA_Yes'?
1>C:\Program Files\Microsoft Visual Studio 9.0\VC\include\ctype.h(99) : error C2337: 'SA_Pre' : attribute not found
1>C:\Program Files\Microsoft Visual Studio 9.0\VC\include\ctype.h(99) : error C2065: 'SA_No' : undeclared identifier
1> missing quotes ("") around 'SA_No'?
1>C:\Program Files\Microsoft Visual Studio 9.0\VC\include\ctype.h(99) : error C2337: 'SA_Pre' : attribute not found
1>C:\Program Files\Microsoft Visual Studio 9.0\VC\include\ctype.h(99) : error C2065: 'SA_Yes' : undeclared identifier
1> missing quotes ("") around 'SA_Yes'?
1>C:\Program Files\Microsoft Visual Studio 9.0\VC\include\ctype.h(99) : error C2065: 'SA_Read' : undeclared identifier
1> missing quotes ("") around 'SA_Read'?
1>C:\Program Files\Microsoft Visual Studio 9.0\VC\include\ctype.h(99) : error C2337: 'SA_Pre' : attribute not found
1>C:\Program Files\Microsoft Visual Studio 9.0\VC\include\ctype.h(99) : error C2065: 'SA_Maybe' : undeclared identifier
1> missing quotes ("") around 'SA_Maybe'?
1>C:\Program Files\Microsoft Visual Studio 9.0\VC\include\ctype.h(99) : error C2337: 'SA_Pre' : attribute not found
1>C:\Program Files\Microsoft Visual Studio 9.0\VC\include\ctype.h(99) : error C2065: 'SA_Yes' : undeclared identifier
1> missing quotes ("") around 'SA_Yes'?
1>C:\Program Files\Microsoft Visual Studio 9.0\VC\include\ctype.h(99) : error C2337: 'SA_Pre' : attribute not found
1>C:\Program Files\Microsoft Visual Studio 9.0\VC\include\ctype.h(99) : error C2065: 'SA_Read' : undeclared identifier
1> missing quotes ("") around 'SA_Read'?
1>C:\Program Files\Microsoft Visual Studio 9.0\VC\include\ctype.h(100) : error C2337: 'SA_Post' : attribute not found
1>C:\Program Files\Microsoft Visual Studio 9.0\VC\include\ctype.h(100) : error C2065: 'SA_Yes' : undeclared identifier
1> missing quotes ("") around 'SA_Yes'?
1>C:\Program Files\Microsoft Visual Studio 9.0\VC\include\ctype.h(100) : error C2337: 'SA_Pre' : attribute not found
1>C:\Program Files\Microsoft Visual Studio 9.0\VC\include\ctype.h(100) : error C2065: 'SA_No' : undeclared identifier
1> missing quotes ("") around 'SA_No'?
1>C:\Program Files\Microsoft Visual Studio 9.0\VC\include\ctype.h(100) : error C2337: 'SA_Pre' : attribute not found
1>C:\Program Files\Microsoft Visual Studio 9.0\VC\include\ctype.h(100) : error C2065: 'SA_Yes' : undeclared identifier
1> missing quotes ("") around 'SA_Yes'?
1>C:\Program Files\Microsoft Visual Studio 9.0\VC\include\ctype.h(100) : error C2065: 'SA_Read' : undeclared identifier
1> missing quotes ("") around 'SA_Read'?
1>C:\Program Files\Microsoft Visual Studio 9.0\VC\include\ctype.h(101) : error C2337: 'SA_Post' : attribute not found
1>C:\Program Files\Microsoft Visual Studio 9.0\VC\include\ctype.h(101) : error C2065: 'SA_Yes' : undeclared identifier
1>C:\Program Files\Microsoft Visual Studio 9.0\VC\include\ctype.h(101) : fatal error C1003: error count exceeds 100; stopping compilation
1>Build log was saved at "file://d:\Meus documentos\Programação Combat Arms\CABASE\H3R0 1.0\CABASE\Release\BuildLog.htm"
1>CABASE - 408 error(s), 0 warning(s)
========== Rebuild All: 0 succeeded, 1 failed, 0 skipped ==========
Aperta atl + f4 umas 5 vezes , ta loko mano vc esta copilando c++ em cobol? lol

Vc usou um atributo que não é suportado na versão do visual c++ , acho que é isso atualize para o visual c++ 2010 express
@BACKD00R

lol ?

Estou compilando como sempre compilei ..
Já fiz hacks com essa base ..

Começou hoje isso
Quote Originally Posted by BACKD00R View Post
Vc tem directx SDK?
Sim , já disse que ja fiz hacks.

Mas é com toda base, antes nao acontecia isso D:
Quote Originally Posted by - Battery' View Post
Sim , já disse que ja fiz hacks.

Mas é com toda base, antes nao acontecia isso D:
EIIIIIIIIIIIIIIIIIIIITA Control+C & Control+V!
Quote Originally Posted by TheVampike View Post
EIIIIIIIIIIIIIIIIIIIITA Control+C & Control+V!
Você ouviu eu dizendo que copiava e colava ?

Eu disse que ja fiz hacks. Ou seja , compilei e a DLL estava lá,

NUNCA POSTEI UM HACK NA MINHA VIDA.

Estou estudando para isso,
E meu primeiro hack não vai ser leechado.

Então pensa ae antes de falar =x

@Capevaldo

Como altero o diretório ?
Quote Originally Posted by - Battery' View Post
Você ouviu eu dizendo que copiava e colava ?

Eu disse que ja fiz hacks. Ou seja , compilei e a DLL estava lá,

NUNCA POSTEI UM HACK NA MINHA VIDA.

Estou estudando para isso,
E meu primeiro hack não vai ser leechado.

Então pensa ae antes de falar =x

@Capevaldo

Como altero o diretório ?
Abre o projeto.
Tools > Options > Projects And Solutions > VC++ Directories > Show Directories For: > Include Files > Clica na pastinha > Escolhe o caminho até a pasta include do SDK

creio que seja só isso.
Multi-Byte?
Esses erros trolls que se repetem muito costumam ser problemas de sintaxe.
Tenta alterar o diretório da pasta include para a pasta include do SDK.
Será? é que nem os kras ai posta base hotkeys em outro forum, e no outro dia aparece base hotkeys , incrivel neh!?
Não sou desse tipo (:

Vocês tem a mania de pensar que todo novato é leecher, aí qualquer dúvida sobre compilar, vocês chegam na defensiva, desconfiando '-'

Eu tenho me dedicado ao C++ 2 horas por dia pelo menos,
Paguei curso,
E estou estudando não apenas DLL's e sim a linguagem no geral.

E quando não estou no curso, uso a MPGH como um meio de tirar minhas dúvidas ..
Quote Originally Posted by - Battery' View Post
Não sou desse tipo (:

Vocês tem a mania de pensar que todo novato é leecher, aí qualquer dúvida sobre compilar, vocês chegam na defensiva, desconfiando '-'

Eu tenho me dedicado ao C++ 2 horas por dia pelo menos,
Paguei curso,
E estou estudando não apenas DLL's e sim a linguagem no geral.

E quando não estou no curso, uso a MPGH como um meio de tirar minhas dúvidas ..
O que eu disse resolveu?
@- Battery'
Quote Originally Posted by Capevaldo View Post


O que eu disse resolveu?
@- Battery'

@Capevaldo

Eu estou baixando o visual C++ atualizado

quando acabar de baixar, se não resolver eu aviso
eu ja disse a solução no começo do topico!
Posts 1–15 of 23 · Page 1 of 2
This thread is closed for replies.

Tags for this Thread

None

Talk with us