Erro ao compilar
qualquer base q vou compilar, da 408 erros. '-'
1>------ Rebuild All started: Project: CABASE, Configuration: Release Win32 ------
1>Deleting intermediate and output files for project 'CABASE', configuration 'Release|Win32'
1>Compiling...
1>Menu.cpp
1>C:\Program Files\Microsoft Visual Studio 9.0\VC\include\excpt.h(60) : error C2337: 'SA_Pre' : attribute not found
1>C:\Program Files\Microsoft Visual Studio 9.0\VC\include\excpt.h(60) : error C2065: 'SA_No' : undeclared identifier
1> missing quotes ("") around 'SA_No'?
1>C:\Program Files\Microsoft Visual Studio 9.0\VC\include\excpt.h(60) : error C2337: 'SA_Pre' : attribute not found
1>C:\Program Files\Microsoft Visual Studio 9.0\VC\include\excpt.h(60) : error C2065: 'SA_Yes' : undeclared identifier
1> missing quotes ("") around 'SA_Yes'?
1>C:\Program Files\Microsoft Visual Studio 9.0\VC\include\excpt.h(60) : error C2065: 'SA_Read' : undeclared identifier
1> missing quotes ("") around 'SA_Read'?
1>C:\Program Files\Microsoft Visual Studio 9.0\VC\include\excpt.h(61) : error C2337: 'SA_Pre' : attribute not found
1>C:\Program Files\Microsoft Visual Studio 9.0\VC\include\excpt.h(61) : error C2065: 'SA_No' : undeclared identifier
1> missing quotes ("") around 'SA_No'?
1>C:\Program Files\Microsoft Visual Studio 9.0\VC\include\excpt.h(61) : error C2337: 'SA_Pre' : attribute not found
1>C:\Program Files\Microsoft Visual Studio 9.0\VC\include\excpt.h(61) : error C2065: 'SA_Yes' : undeclared identifier
1> missing quotes ("") around 'SA_Yes'?
1>C:\Program Files\Microsoft Visual Studio 9.0\VC\include\excpt.h(61) : error C2065: 'SA_Read' : undeclared identifier
1> missing quotes ("") around 'SA_Read'?
1>C:\Program Files\Microsoft Visual Studio 9.0\VC\include\excpt.h(62) : error C2337: 'SA_Pre' : attribute not found
1>C:\Program Files\Microsoft Visual Studio 9.0\VC\include\excpt.h(62) : error C2065: 'SA_No' : undeclared identifier
1> missing quotes ("") around 'SA_No'?
1>C:\Program Files\Microsoft Visual Studio 9.0\VC\include\excpt.h(62) : error C2337: 'SA_Pre' : attribute not found
1>C:\Program Files\Microsoft Visual Studio 9.0\VC\include\excpt.h(62) : error C2065: 'SA_Yes' : undeclared identifier
1> missing quotes ("") around 'SA_Yes'?
1>C:\Program Files\Microsoft Visual Studio 9.0\VC\include\excpt.h(62) : error C2337: 'SA_Post' : attribute not found
1>C:\Program Files\Microsoft Visual Studio 9.0\VC\include\excpt.h(62) : error C2065: 'SA_Yes' : undeclared identifier
1> missing quotes ("") around 'SA_Yes'?
1>C:\Program Files\Microsoft Visual Studio 9.0\VC\include\excpt.h(63) : error C2337: 'SA_Pre' : attribute not found
1>C:\Program Files\Microsoft Visual Studio 9.0\VC\include\excpt.h(63) : error C2065: 'SA_No' : undeclared identifier
1> missing quotes ("") around 'SA_No'?
1>C:\Program Files\Microsoft Visual Studio 9.0\VC\include\excpt.h(63) : error C2337: 'SA_Pre' : attribute not found
1>C:\Program Files\Microsoft Visual Studio 9.0\VC\include\excpt.h(63) : error C2065: 'SA_Yes' : undeclared identifier
1> missing quotes ("") around 'SA_Yes'?
1>C:\Program Files\Microsoft Visual Studio 9.0\VC\include\excpt.h(63) : error C2337: 'SA_Post' : attribute not found
1>C:\Program Files\Microsoft Visual Studio 9.0\VC\include\excpt.h(63) : error C2065: 'SA_Yes' : undeclared identifier
1> missing quotes ("") around 'SA_Yes'?
1>C:\Program Files\Microsoft Visual Studio 9.0\VC\include\ctype.h(94) : error C2337: 'SA_Post' : attribute not found
1>C:\Program Files\Microsoft Visual Studio 9.0\VC\include\ctype.h(94) : error C2065: 'SA_Yes' : undeclared identifier
1> missing quotes ("") around 'SA_Yes'?
1>C:\Program Files\Microsoft Visual Studio 9.0\VC\include\ctype.h(94) : error C2337: 'SA_Pre' : attribute not found
1>C:\Program Files\Microsoft Visual Studio 9.0\VC\include\ctype.h(94) : error C2065: 'SA_No' : undeclared identifier
1> missing quotes ("") around 'SA_No'?
1>C:\Program Files\Microsoft Visual Studio 9.0\VC\include\ctype.h(94) : error C2337: 'SA_Pre' : attribute not found
1>C:\Program Files\Microsoft Visual Studio 9.0\VC\include\ctype.h(94) : error C2065: 'SA_Yes' : undeclared identifier
1> missing quotes ("") around 'SA_Yes'?
1>C:\Program Files\Microsoft Visual Studio 9.0\VC\include\ctype.h(94) : error C2065: 'SA_Read' : undeclared identifier
1> missing quotes ("") around 'SA_Read'?
1>C:\Program Files\Microsoft Visual Studio 9.0\VC\include\ctype.h(94) : error C2337: 'SA_Pre' : attribute not found
1>C:\Program Files\Microsoft Visual Studio 9.0\VC\include\ctype.h(94) : error C2065: 'SA_No' : undeclared identifier
1> missing quotes ("") around 'SA_No'?
1>C:\Program Files\Microsoft Visual Studio 9.0\VC\include\ctype.h(94) : error C2337: 'SA_Pre' : attribute not found
1>C:\Program Files\Microsoft Visual Studio 9.0\VC\include\ctype.h(94) : error C2065: 'SA_Yes' : undeclared identifier
1> missing quotes ("") around 'SA_Yes'?
1>C:\Program Files\Microsoft Visual Studio 9.0\VC\include\ctype.h(94) : error C2065: 'SA_Read' : undeclared identifier
1> missing quotes ("") around 'SA_Read'?
1>C:\Program Files\Microsoft Visual Studio 9.0\VC\include\ctype.h(95) : error C2337: 'SA_Post' : attribute not found
1>C:\Program Files\Microsoft Visual Studio 9.0\VC\include\ctype.h(95) : error C2065: 'SA_Yes' : undeclared identifier
1> missing quotes ("") around 'SA_Yes'?
1>C:\Program Files\Microsoft Visual Studio 9.0\VC\include\ctype.h(95) : error C2337: 'SA_Pre' : attribute not found
1>C:\Program Files\Microsoft Visual Studio 9.0\VC\include\ctype.h(95) : error C2065: 'SA_No' : undeclared identifier
1> missing quotes ("") around 'SA_No'?
1>C:\Program Files\Microsoft Visual Studio 9.0\VC\include\ctype.h(95) : error C2337: 'SA_Pre' : attribute not found
1>C:\Program Files\Microsoft Visual Studio 9.0\VC\include\ctype.h(95) : error C2065: 'SA_Yes' : undeclared identifier
1> missing quotes ("") around 'SA_Yes'?
1>C:\Program Files\Microsoft Visual Studio 9.0\VC\include\ctype.h(95) : error C2065: 'SA_Read' : undeclared identifier
1> missing quotes ("") around 'SA_Read'?
1>C:\Program Files\Microsoft Visual Studio 9.0\VC\include\ctype.h(95) : error C2337: 'SA_Pre' : attribute not found
1>C:\Program Files\Microsoft Visual Studio 9.0\VC\include\ctype.h(95) : error C2065: 'SA_No' : undeclared identifier
1> missing quotes ("") around 'SA_No'?
1>C:\Program Files\Microsoft Visual Studio 9.0\VC\include\ctype.h(95) : error C2337: 'SA_Pre' : attribute not found
1>C:\Program Files\Microsoft Visual Studio 9.0\VC\include\ctype.h(95) : error C2065: 'SA_Yes' : undeclared identifier
1> missing quotes ("") around 'SA_Yes'?
1>C:\Program Files\Microsoft Visual Studio 9.0\VC\include\ctype.h(95) : error C2065: 'SA_Read' : undeclared identifier
1> missing quotes ("") around 'SA_Read'?
1>C:\Program Files\Microsoft Visual Studio 9.0\VC\include\ctype.h(95) : error C2337: 'SA_Pre' : attribute not found
1>C:\Program Files\Microsoft Visual Studio 9.0\VC\include\ctype.h(95) : error C2065: 'SA_Maybe' : undeclared identifier
1> missing quotes ("") around 'SA_Maybe'?
1>C:\Program Files\Microsoft Visual Studio 9.0\VC\include\ctype.h(95) : error C2337: 'SA_Pre' : attribute not found
1>C:\Program Files\Microsoft Visual Studio 9.0\VC\include\ctype.h(95) : error C2065: 'SA_Yes' : undeclared identifier
1> missing quotes ("") around 'SA_Yes'?
1>C:\Program Files\Microsoft Visual Studio 9.0\VC\include\ctype.h(95) : error C2337: 'SA_Pre' : attribute not found
1>C:\Program Files\Microsoft Visual Studio 9.0\VC\include\ctype.h(95) : error C2065: 'SA_Read' : undeclared identifier
1> missing quotes ("") around 'SA_Read'?
1>C:\Program Files\Microsoft Visual Studio 9.0\VC\include\ctype.h(96) : error C2337: 'SA_Post' : attribute not found
1>C:\Program Files\Microsoft Visual Studio 9.0\VC\include\ctype.h(96) : error C2065: 'SA_Yes' : undeclared identifier
1> missing quotes ("") around 'SA_Yes'?
1>C:\Program Files\Microsoft Visual Studio 9.0\VC\include\ctype.h(96) : error C2337: 'SA_Pre' : attribute not found
1>C:\Program Files\Microsoft Visual Studio 9.0\VC\include\ctype.h(96) : error C2065: 'SA_No' : undeclared identifier
1> missing quotes ("") around 'SA_No'?
1>C:\Program Files\Microsoft Visual Studio 9.0\VC\include\ctype.h(96) : error C2337: 'SA_Pre' : attribute not found
1>C:\Program Files\Microsoft Visual Studio 9.0\VC\include\ctype.h(96) : error C2065: 'SA_Yes' : undeclared identifier
1> missing quotes ("") around 'SA_Yes'?
1>C:\Program Files\Microsoft Visual Studio 9.0\VC\include\ctype.h(96) : error C2065: 'SA_Read' : undeclared identifier
1> missing quotes ("") around 'SA_Read'?
1>C:\Program Files\Microsoft Visual Studio 9.0\VC\include\ctype.h(97) : error C2337: 'SA_Post' : attribute not found
1>C:\Program Files\Microsoft Visual Studio 9.0\VC\include\ctype.h(97) : error C2065: 'SA_Yes' : undeclared identifier
1> missing quotes ("") around 'SA_Yes'?
1>C:\Program Files\Microsoft Visual Studio 9.0\VC\include\ctype.h(97) : error C2337: 'SA_Pre' : attribute not found
1>C:\Program Files\Microsoft Visual Studio 9.0\VC\include\ctype.h(97) : error C2065: 'SA_No' : undeclared identifier
1> missing quotes ("") around 'SA_No'?
1>C:\Program Files\Microsoft Visual Studio 9.0\VC\include\ctype.h(97) : error C2337: 'SA_Pre' : attribute not found
1>C:\Program Files\Microsoft Visual Studio 9.0\VC\include\ctype.h(97) : error C2065: 'SA_Yes' : undeclared identifier
1> missing quotes ("") around 'SA_Yes'?
1>C:\Program Files\Microsoft Visual Studio 9.0\VC\include\ctype.h(97) : error C2065: 'SA_Read' : undeclared identifier
1> missing quotes ("") around 'SA_Read'?
1>C:\Program Files\Microsoft Visual Studio 9.0\VC\include\ctype.h(97) : error C2337: 'SA_Pre' : attribute not found
1>C:\Program Files\Microsoft Visual Studio 9.0\VC\include\ctype.h(97) : error C2065: 'SA_Maybe' : undeclared identifier
1> missing quotes ("") around 'SA_Maybe'?
1>C:\Program Files\Microsoft Visual Studio 9.0\VC\include\ctype.h(97) : error C2337: 'SA_Pre' : attribute not found
1>C:\Program Files\Microsoft Visual Studio 9.0\VC\include\ctype.h(97) : error C2065: 'SA_Yes' : undeclared identifier
1> missing quotes ("") around 'SA_Yes'?
1>C:\Program Files\Microsoft Visual Studio 9.0\VC\include\ctype.h(97) : error C2337: 'SA_Pre' : attribute not found
1>C:\Program Files\Microsoft Visual Studio 9.0\VC\include\ctype.h(97) : error C2065: 'SA_Read' : undeclared identifier
1> missing quotes ("") around 'SA_Read'?
1>C:\Program Files\Microsoft Visual Studio 9.0\VC\include\ctype.h(98) : error C2337: 'SA_Post' : attribute not found
1>C:\Program Files\Microsoft Visual Studio 9.0\VC\include\ctype.h(98) : error C2065: 'SA_Yes' : undeclared identifier
1> missing quotes ("") around 'SA_Yes'?
1>C:\Program Files\Microsoft Visual Studio 9.0\VC\include\ctype.h(98) : error C2337: 'SA_Pre' : attribute not found
1>C:\Program Files\Microsoft Visual Studio 9.0\VC\include\ctype.h(98) : error C2065: 'SA_No' : undeclared identifier
1> missing quotes ("") around 'SA_No'?
1>C:\Program Files\Microsoft Visual Studio 9.0\VC\include\ctype.h(98) : error C2337: 'SA_Pre' : attribute not found
1>C:\Program Files\Microsoft Visual Studio 9.0\VC\include\ctype.h(98) : error C2065: 'SA_Yes' : undeclared identifier
1> missing quotes ("") around 'SA_Yes'?
1>C:\Program Files\Microsoft Visual Studio 9.0\VC\include\ctype.h(98) : error C2065: 'SA_Read' : undeclared identifier
1> missing quotes ("") around 'SA_Read'?
1>C:\Program Files\Microsoft Visual Studio 9.0\VC\include\ctype.h(99) : error C2337: 'SA_Post' : attribute not found
1>C:\Program Files\Microsoft Visual Studio 9.0\VC\include\ctype.h(99) : error C2065: 'SA_Yes' : undeclared identifier
1> missing quotes ("") around 'SA_Yes'?
1>C:\Program Files\Microsoft Visual Studio 9.0\VC\include\ctype.h(99) : error C2337: 'SA_Pre' : attribute not found
1>C:\Program Files\Microsoft Visual Studio 9.0\VC\include\ctype.h(99) : error C2065: 'SA_No' : undeclared identifier
1> missing quotes ("") around 'SA_No'?
1>C:\Program Files\Microsoft Visual Studio 9.0\VC\include\ctype.h(99) : error C2337: 'SA_Pre' : attribute not found
1>C:\Program Files\Microsoft Visual Studio 9.0\VC\include\ctype.h(99) : error C2065: 'SA_Yes' : undeclared identifier
1> missing quotes ("") around 'SA_Yes'?
1>C:\Program Files\Microsoft Visual Studio 9.0\VC\include\ctype.h(99) : error C2065: 'SA_Read' : undeclared identifier
1> missing quotes ("") around 'SA_Read'?
1>C:\Program Files\Microsoft Visual Studio 9.0\VC\include\ctype.h(99) : error C2337: 'SA_Pre' : attribute not found
1>C:\Program Files\Microsoft Visual Studio 9.0\VC\include\ctype.h(99) : error C2065: 'SA_Maybe' : undeclared identifier
1> missing quotes ("") around 'SA_Maybe'?
1>C:\Program Files\Microsoft Visual Studio 9.0\VC\include\ctype.h(99) : error C2337: 'SA_Pre' : attribute not found
1>C:\Program Files\Microsoft Visual Studio 9.0\VC\include\ctype.h(99) : error C2065: 'SA_Yes' : undeclared identifier
1> missing quotes ("") around 'SA_Yes'?
1>C:\Program Files\Microsoft Visual Studio 9.0\VC\include\ctype.h(99) : error C2337: 'SA_Pre' : attribute not found
1>C:\Program Files\Microsoft Visual Studio 9.0\VC\include\ctype.h(99) : error C2065: 'SA_Read' : undeclared identifier
1> missing quotes ("") around 'SA_Read'?
1>C:\Program Files\Microsoft Visual Studio 9.0\VC\include\ctype.h(100) : error C2337: 'SA_Post' : attribute not found
1>C:\Program Files\Microsoft Visual Studio 9.0\VC\include\ctype.h(100) : error C2065: 'SA_Yes' : undeclared identifier
1> missing quotes ("") around 'SA_Yes'?
1>C:\Program Files\Microsoft Visual Studio 9.0\VC\include\ctype.h(100) : error C2337: 'SA_Pre' : attribute not found
1>C:\Program Files\Microsoft Visual Studio 9.0\VC\include\ctype.h(100) : error C2065: 'SA_No' : undeclared identifier
1> missing quotes ("") around 'SA_No'?
1>C:\Program Files\Microsoft Visual Studio 9.0\VC\include\ctype.h(100) : error C2337: 'SA_Pre' : attribute not found
1>C:\Program Files\Microsoft Visual Studio 9.0\VC\include\ctype.h(100) : error C2065: 'SA_Yes' : undeclared identifier
1> missing quotes ("") around 'SA_Yes'?
1>C:\Program Files\Microsoft Visual Studio 9.0\VC\include\ctype.h(100) : error C2065: 'SA_Read' : undeclared identifier
1> missing quotes ("") around 'SA_Read'?
1>C:\Program Files\Microsoft Visual Studio 9.0\VC\include\ctype.h(101) : error C2337: 'SA_Post' : attribute not found
1>C:\Program Files\Microsoft Visual Studio 9.0\VC\include\ctype.h(101) : error C2065: 'SA_Yes' : undeclared identifier
1>C:\Program Files\Microsoft Visual Studio 9.0\VC\include\ctype.h(101) : fatal error C1003: error count exceeds 100; stopping compilation
1>DirectX.cpp
1>C:\Program Files\Microsoft Visual Studio 9.0\VC\include\excpt.h(60) : error C2337: 'SA_Pre' : attribute not found
1>C:\Program Files\Microsoft Visual Studio 9.0\VC\include\excpt.h(60) : error C2065: 'SA_No' : undeclared identifier
1> missing quotes ("") around 'SA_No'?
1>C:\Program Files\Microsoft Visual Studio 9.0\VC\include\excpt.h(60) : error C2337: 'SA_Pre' : attribute not found
1>C:\Program Files\Microsoft Visual Studio 9.0\VC\include\excpt.h(60) : error C2065: 'SA_Yes' : undeclared identifier
1> missing quotes ("") around 'SA_Yes'?
1>C:\Program Files\Microsoft Visual Studio 9.0\VC\include\excpt.h(60) : error C2065: 'SA_Read' : undeclared identifier
1> missing quotes ("") around 'SA_Read'?
1>C:\Program Files\Microsoft Visual Studio 9.0\VC\include\excpt.h(61) : error C2337: 'SA_Pre' : attribute not found
1>C:\Program Files\Microsoft Visual Studio 9.0\VC\include\excpt.h(61) : error C2065: 'SA_No' : undeclared identifier
1> missing quotes ("") around 'SA_No'?
1>C:\Program Files\Microsoft Visual Studio 9.0\VC\include\excpt.h(61) : error C2337: 'SA_Pre' : attribute not found
1>C:\Program Files\Microsoft Visual Studio 9.0\VC\include\excpt.h(61) : error C2065: 'SA_Yes' : undeclared identifier
1> missing quotes ("") around 'SA_Yes'?
1>C:\Program Files\Microsoft Visual Studio 9.0\VC\include\excpt.h(61) : error C2065: 'SA_Read' : undeclared identifier
1> missing quotes ("") around 'SA_Read'?
1>C:\Program Files\Microsoft Visual Studio 9.0\VC\include\excpt.h(62) : error C2337: 'SA_Pre' : attribute not found
1>C:\Program Files\Microsoft Visual Studio 9.0\VC\include\excpt.h(62) : error C2065: 'SA_No' : undeclared identifier
1> missing quotes ("") around 'SA_No'?
1>C:\Program Files\Microsoft Visual Studio 9.0\VC\include\excpt.h(62) : error C2337: 'SA_Pre' : attribute not found
1>C:\Program Files\Microsoft Visual Studio 9.0\VC\include\excpt.h(62) : error C2065: 'SA_Yes' : undeclared identifier
1> missing quotes ("") around 'SA_Yes'?
1>C:\Program Files\Microsoft Visual Studio 9.0\VC\include\excpt.h(62) : error C2337: 'SA_Post' : attribute not found
1>C:\Program Files\Microsoft Visual Studio 9.0\VC\include\excpt.h(62) : error C2065: 'SA_Yes' : undeclared identifier
1> missing quotes ("") around 'SA_Yes'?
1>C:\Program Files\Microsoft Visual Studio 9.0\VC\include\excpt.h(63) : error C2337: 'SA_Pre' : attribute not found
1>C:\Program Files\Microsoft Visual Studio 9.0\VC\include\excpt.h(63) : error C2065: 'SA_No' : undeclared identifier
1> missing quotes ("") around 'SA_No'?
1>C:\Program Files\Microsoft Visual Studio 9.0\VC\include\excpt.h(63) : error C2337: 'SA_Pre' : attribute not found
1>C:\Program Files\Microsoft Visual Studio 9.0\VC\include\excpt.h(63) : error C2065: 'SA_Yes' : undeclared identifier
1> missing quotes ("") around 'SA_Yes'?
1>C:\Program Files\Microsoft Visual Studio 9.0\VC\include\excpt.h(63) : error C2337: 'SA_Post' : attribute not found
1>C:\Program Files\Microsoft Visual Studio 9.0\VC\include\excpt.h(63) : error C2065: 'SA_Yes' : undeclared identifier
1> missing quotes ("") around 'SA_Yes'?
1>C:\Program Files\Microsoft Visual Studio 9.0\VC\include\ctype.h(94) : error C2337: 'SA_Post' : attribute not found
1>C:\Program Files\Microsoft Visual Studio 9.0\VC\include\ctype.h(94) : error C2065: 'SA_Yes' : undeclared identifier
1> missing quotes ("") around 'SA_Yes'?
1>C:\Program Files\Microsoft Visual Studio 9.0\VC\include\ctype.h(94) : error C2337: 'SA_Pre' : attribute not found
1>C:\Program Files\Microsoft Visual Studio 9.0\VC\include\ctype.h(94) : error C2065: 'SA_No' : undeclared identifier
1> missing quotes ("") around 'SA_No'?
1>C:\Program Files\Microsoft Visual Studio 9.0\VC\include\ctype.h(94) : error C2337: 'SA_Pre' : attribute not found
1>C:\Program Files\Microsoft Visual Studio 9.0\VC\include\ctype.h(94) : error C2065: 'SA_Yes' : undeclared identifier
1> missing quotes ("") around 'SA_Yes'?
1>C:\Program Files\Microsoft Visual Studio 9.0\VC\include\ctype.h(94) : error C2065: 'SA_Read' : undeclared identifier
1> missing quotes ("") around 'SA_Read'?
1>C:\Program Files\Microsoft Visual Studio 9.0\VC\include\ctype.h(94) : error C2337: 'SA_Pre' : attribute not found
1>C:\Program Files\Microsoft Visual Studio 9.0\VC\include\ctype.h(94) : error C2065: 'SA_No' : undeclared identifier
1> missing quotes ("") around 'SA_No'?
1>C:\Program Files\Microsoft Visual Studio 9.0\VC\include\ctype.h(94) : error C2337: 'SA_Pre' : attribute not found
1>C:\Program Files\Microsoft Visual Studio 9.0\VC\include\ctype.h(94) : error C2065: 'SA_Yes' : undeclared identifier
1> missing quotes ("") around 'SA_Yes'?
1>C:\Program Files\Microsoft Visual Studio 9.0\VC\include\ctype.h(94) : error C2065: 'SA_Read' : undeclared identifier
1> missing quotes ("") around 'SA_Read'?
1>C:\Program Files\Microsoft Visual Studio 9.0\VC\include\ctype.h(95) : error C2337: 'SA_Post' : attribute not found
1>C:\Program Files\Microsoft Visual Studio 9.0\VC\include\ctype.h(95) : error C2065: 'SA_Yes' : undeclared identifier
1> missing quotes ("") around 'SA_Yes'?
1>C:\Program Files\Microsoft Visual Studio 9.0\VC\include\ctype.h(95) : error C2337: 'SA_Pre' : attribute not found
1>C:\Program Files\Microsoft Visual Studio 9.0\VC\include\ctype.h(95) : error C2065: 'SA_No' : undeclared identifier
1> missing quotes ("") around 'SA_No'?
1>C:\Program Files\Microsoft Visual Studio 9.0\VC\include\ctype.h(95) : error C2337: 'SA_Pre' : attribute not found
1>C:\Program Files\Microsoft Visual Studio 9.0\VC\include\ctype.h(95) : error C2065: 'SA_Yes' : undeclared identifier
1> missing quotes ("") around 'SA_Yes'?
1>C:\Program Files\Microsoft Visual Studio 9.0\VC\include\ctype.h(95) : error C2065: 'SA_Read' : undeclared identifier
1> missing quotes ("") around 'SA_Read'?
1>C:\Program Files\Microsoft Visual Studio 9.0\VC\include\ctype.h(95) : error C2337: 'SA_Pre' : attribute not found
1>C:\Program Files\Microsoft Visual Studio 9.0\VC\include\ctype.h(95) : error C2065: 'SA_No' : undeclared identifier
1> missing quotes ("") around 'SA_No'?
1>C:\Program Files\Microsoft Visual Studio 9.0\VC\include\ctype.h(95) : error C2337: 'SA_Pre' : attribute not found
1>C:\Program Files\Microsoft Visual Studio 9.0\VC\include\ctype.h(95) : error C2065: 'SA_Yes' : undeclared identifier
1> missing quotes ("") around 'SA_Yes'?
1>C:\Program Files\Microsoft Visual Studio 9.0\VC\include\ctype.h(95) : error C2065: 'SA_Read' : undeclared identifier
1> missing quotes ("") around 'SA_Read'?
1>C:\Program Files\Microsoft Visual Studio 9.0\VC\include\ctype.h(95) : error C2337: 'SA_Pre' : attribute not found
1>C:\Program Files\Microsoft Visual Studio 9.0\VC\include\ctype.h(95) : error C2065: 'SA_Maybe' : undeclared identifier
1> missing quotes ("") around 'SA_Maybe'?
1>C:\Program Files\Microsoft Visual Studio 9.0\VC\include\ctype.h(95) : error C2337: 'SA_Pre' : attribute not found
1>C:\Program Files\Microsoft Visual Studio 9.0\VC\include\ctype.h(95) : error C2065: 'SA_Yes' : undeclared identifier
1> missing quotes ("") around 'SA_Yes'?
1>C:\Program Files\Microsoft Visual Studio 9.0\VC\include\ctype.h(95) : error C2337: 'SA_Pre' : attribute not found
1>C:\Program Files\Microsoft Visual Studio 9.0\VC\include\ctype.h(95) : error C2065: 'SA_Read' : undeclared identifier
1> missing quotes ("") around 'SA_Read'?
1>C:\Program Files\Microsoft Visual Studio 9.0\VC\include\ctype.h(96) : error C2337: 'SA_Post' : attribute not found
1>C:\Program Files\Microsoft Visual Studio 9.0\VC\include\ctype.h(96) : error C2065: 'SA_Yes' : undeclared identifier
1> missing quotes ("") around 'SA_Yes'?
1>C:\Program Files\Microsoft Visual Studio 9.0\VC\include\ctype.h(96) : error C2337: 'SA_Pre' : attribute not found
1>C:\Program Files\Microsoft Visual Studio 9.0\VC\include\ctype.h(96) : error C2065: 'SA_No' : undeclared identifier
1> missing quotes ("") around 'SA_No'?
1>C:\Program Files\Microsoft Visual Studio 9.0\VC\include\ctype.h(96) : error C2337: 'SA_Pre' : attribute not found
1>C:\Program Files\Microsoft Visual Studio 9.0\VC\include\ctype.h(96) : error C2065: 'SA_Yes' : undeclared identifier
1> missing quotes ("") around 'SA_Yes'?
1>C:\Program Files\Microsoft Visual Studio 9.0\VC\include\ctype.h(96) : error C2065: 'SA_Read' : undeclared identifier
1> missing quotes ("") around 'SA_Read'?
1>C:\Program Files\Microsoft Visual Studio 9.0\VC\include\ctype.h(97) : error C2337: 'SA_Post' : attribute not found
1>C:\Program Files\Microsoft Visual Studio 9.0\VC\include\ctype.h(97) : error C2065: 'SA_Yes' : undeclared identifier
1> missing quotes ("") around 'SA_Yes'?
1>C:\Program Files\Microsoft Visual Studio 9.0\VC\include\ctype.h(97) : error C2337: 'SA_Pre' : attribute not found
1>C:\Program Files\Microsoft Visual Studio 9.0\VC\include\ctype.h(97) : error C2065: 'SA_No' : undeclared identifier
1> missing quotes ("") around 'SA_No'?
1>C:\Program Files\Microsoft Visual Studio 9.0\VC\include\ctype.h(97) : error C2337: 'SA_Pre' : attribute not found
1>C:\Program Files\Microsoft Visual Studio 9.0\VC\include\ctype.h(97) : error C2065: 'SA_Yes' : undeclared identifier
1> missing quotes ("") around 'SA_Yes'?
1>C:\Program Files\Microsoft Visual Studio 9.0\VC\include\ctype.h(97) : error C2065: 'SA_Read' : undeclared identifier
1> missing quotes ("") around 'SA_Read'?
1>C:\Program Files\Microsoft Visual Studio 9.0\VC\include\ctype.h(97) : error C2337: 'SA_Pre' : attribute not found
1>C:\Program Files\Microsoft Visual Studio 9.0\VC\include\ctype.h(97) : error C2065: 'SA_Maybe' : undeclared identifier
1> missing quotes ("") around 'SA_Maybe'?
1>C:\Program Files\Microsoft Visual Studio 9.0\VC\include\ctype.h(97) : error C2337: 'SA_Pre' : attribute not found
1>C:\Program Files\Microsoft Visual Studio 9.0\VC\include\ctype.h(97) : error C2065: 'SA_Yes' : undeclared identifier
1> missing quotes ("") around 'SA_Yes'?
1>C:\Program Files\Microsoft Visual Studio 9.0\VC\include\ctype.h(97) : error C2337: 'SA_Pre' : attribute not found
1>C:\Program Files\Microsoft Visual Studio 9.0\VC\include\ctype.h(97) : error C2065: 'SA_Read' : undeclared identifier
1> missing quotes ("") around 'SA_Read'?
1>C:\Program Files\Microsoft Visual Studio 9.0\VC\include\ctype.h(98) : error C2337: 'SA_Post' : attribute not found
1>C:\Program Files\Microsoft Visual Studio 9.0\VC\include\ctype.h(98) : error C2065: 'SA_Yes' : undeclared identifier
1> missing quotes ("") around 'SA_Yes'?
1>C:\Program Files\Microsoft Visual Studio 9.0\VC\include\ctype.h(98) : error C2337: 'SA_Pre' : attribute not found
1>C:\Program Files\Microsoft Visual Studio 9.0\VC\include\ctype.h(98) : error C2065: 'SA_No' : undeclared identifier
1> missing quotes ("") around 'SA_No'?
1>C:\Program Files\Microsoft Visual Studio 9.0\VC\include\ctype.h(98) : error C2337: 'SA_Pre' : attribute not found
1>C:\Program Files\Microsoft Visual Studio 9.0\VC\include\ctype.h(98) : error C2065: 'SA_Yes' : undeclared identifier
1> missing quotes ("") around 'SA_Yes'?
1>C:\Program Files\Microsoft Visual Studio 9.0\VC\include\ctype.h(98) : error C2065: 'SA_Read' : undeclared identifier
1> missing quotes ("") around 'SA_Read'?
1>C:\Program Files\Microsoft Visual Studio 9.0\VC\include\ctype.h(99) : error C2337: 'SA_Post' : attribute not found
1>C:\Program Files\Microsoft Visual Studio 9.0\VC\include\ctype.h(99) : error C2065: 'SA_Yes' : undeclared identifier
1> missing quotes ("") around 'SA_Yes'?
1>C:\Program Files\Microsoft Visual Studio 9.0\VC\include\ctype.h(99) : error C2337: 'SA_Pre' : attribute not found
1>C:\Program Files\Microsoft Visual Studio 9.0\VC\include\ctype.h(99) : error C2065: 'SA_No' : undeclared identifier
1> missing quotes ("") around 'SA_No'?
1>C:\Program Files\Microsoft Visual Studio 9.0\VC\include\ctype.h(99) : error C2337: 'SA_Pre' : attribute not found
1>C:\Program Files\Microsoft Visual Studio 9.0\VC\include\ctype.h(99) : error C2065: 'SA_Yes' : undeclared identifier
1> missing quotes ("") around 'SA_Yes'?
1>C:\Program Files\Microsoft Visual Studio 9.0\VC\include\ctype.h(99) : error C2065: 'SA_Read' : undeclared identifier
1> missing quotes ("") around 'SA_Read'?
1>C:\Program Files\Microsoft Visual Studio 9.0\VC\include\ctype.h(99) : error C2337: 'SA_Pre' : attribute not found
1>C:\Program Files\Microsoft Visual Studio 9.0\VC\include\ctype.h(99) : error C2065: 'SA_Maybe' : undeclared identifier
1> missing quotes ("") around 'SA_Maybe'?
1>C:\Program Files\Microsoft Visual Studio 9.0\VC\include\ctype.h(99) : error C2337: 'SA_Pre' : attribute not found
1>C:\Program Files\Microsoft Visual Studio 9.0\VC\include\ctype.h(99) : error C2065: 'SA_Yes' : undeclared identifier
1> missing quotes ("") around 'SA_Yes'?
1>C:\Program Files\Microsoft Visual Studio 9.0\VC\include\ctype.h(99) : error C2337: 'SA_Pre' : attribute not found
1>C:\Program Files\Microsoft Visual Studio 9.0\VC\include\ctype.h(99) : error C2065: 'SA_Read' : undeclared identifier
1> missing quotes ("") around 'SA_Read'?
1>C:\Program Files\Microsoft Visual Studio 9.0\VC\include\ctype.h(100) : error C2337: 'SA_Post' : attribute not found
1>C:\Program Files\Microsoft Visual Studio 9.0\VC\include\ctype.h(100) : error C2065: 'SA_Yes' : undeclared identifier
1> missing quotes ("") around 'SA_Yes'?
1>C:\Program Files\Microsoft Visual Studio 9.0\VC\include\ctype.h(100) : error C2337: 'SA_Pre' : attribute not found
1>C:\Program Files\Microsoft Visual Studio 9.0\VC\include\ctype.h(100) : error C2065: 'SA_No' : undeclared identifier
1> missing quotes ("") around 'SA_No'?
1>C:\Program Files\Microsoft Visual Studio 9.0\VC\include\ctype.h(100) : error C2337: 'SA_Pre' : attribute not found
1>C:\Program Files\Microsoft Visual Studio 9.0\VC\include\ctype.h(100) : error C2065: 'SA_Yes' : undeclared identifier
1> missing quotes ("") around 'SA_Yes'?
1>C:\Program Files\Microsoft Visual Studio 9.0\VC\include\ctype.h(100) : error C2065: 'SA_Read' : undeclared identifier
1> missing quotes ("") around 'SA_Read'?
1>C:\Program Files\Microsoft Visual Studio 9.0\VC\include\ctype.h(101) : error C2337: 'SA_Post' : attribute not found
1>C:\Program Files\Microsoft Visual Studio 9.0\VC\include\ctype.h(101) : error C2065: 'SA_Yes' : undeclared identifier
1>C:\Program Files\Microsoft Visual Studio 9.0\VC\include\ctype.h(101) : fatal error C1003: error count exceeds 100; stopping compilation
1>detours.cpp
1>C:\Program Files\Microsoft Visual Studio 9.0\VC\include\excpt.h(60) : error C2337: 'SA_Pre' : attribute not found
1>C:\Program Files\Microsoft Visual Studio 9.0\VC\include\excpt.h(60) : error C2065: 'SA_No' : undeclared identifier
1> missing quotes ("") around 'SA_No'?
1>C:\Program Files\Microsoft Visual Studio 9.0\VC\include\excpt.h(60) : error C2337: 'SA_Pre' : attribute not found
1>C:\Program Files\Microsoft Visual Studio 9.0\VC\include\excpt.h(60) : error C2065: 'SA_Yes' : undeclared identifier
1> missing quotes ("") around 'SA_Yes'?
1>C:\Program Files\Microsoft Visual Studio 9.0\VC\include\excpt.h(60) : error C2065: 'SA_Read' : undeclared identifier
1> missing quotes ("") around 'SA_Read'?
1>C:\Program Files\Microsoft Visual Studio 9.0\VC\include\excpt.h(61) : error C2337: 'SA_Pre' : attribute not found
1>C:\Program Files\Microsoft Visual Studio 9.0\VC\include\excpt.h(61) : error C2065: 'SA_No' : undeclared identifier
1> missing quotes ("") around 'SA_No'?
1>C:\Program Files\Microsoft Visual Studio 9.0\VC\include\excpt.h(61) : error C2337: 'SA_Pre' : attribute not found
1>C:\Program Files\Microsoft Visual Studio 9.0\VC\include\excpt.h(61) : error C2065: 'SA_Yes' : undeclared identifier
1> missing quotes ("") around 'SA_Yes'?
1>C:\Program Files\Microsoft Visual Studio 9.0\VC\include\excpt.h(61) : error C2065: 'SA_Read' : undeclared identifier
1> missing quotes ("") around 'SA_Read'?
1>C:\Program Files\Microsoft Visual Studio 9.0\VC\include\excpt.h(62) : error C2337: 'SA_Pre' : attribute not found
1>C:\Program Files\Microsoft Visual Studio 9.0\VC\include\excpt.h(62) : error C2065: 'SA_No' : undeclared identifier
1> missing quotes ("") around 'SA_No'?
1>C:\Program Files\Microsoft Visual Studio 9.0\VC\include\excpt.h(62) : error C2337: 'SA_Pre' : attribute not found
1>C:\Program Files\Microsoft Visual Studio 9.0\VC\include\excpt.h(62) : error C2065: 'SA_Yes' : undeclared identifier
1> missing quotes ("") around 'SA_Yes'?
1>C:\Program Files\Microsoft Visual Studio 9.0\VC\include\excpt.h(62) : error C2337: 'SA_Post' : attribute not found
1>C:\Program Files\Microsoft Visual Studio 9.0\VC\include\excpt.h(62) : error C2065: 'SA_Yes' : undeclared identifier
1> missing quotes ("") around 'SA_Yes'?
1>C:\Program Files\Microsoft Visual Studio 9.0\VC\include\excpt.h(63) : error C2337: 'SA_Pre' : attribute not found
1>C:\Program Files\Microsoft Visual Studio 9.0\VC\include\excpt.h(63) : error C2065: 'SA_No' : undeclared identifier
1> missing quotes ("") around 'SA_No'?
1>C:\Program Files\Microsoft Visual Studio 9.0\VC\include\excpt.h(63) : error C2337: 'SA_Pre' : attribute not found
1>C:\Program Files\Microsoft Visual Studio 9.0\VC\include\excpt.h(63) : error C2065: 'SA_Yes' : undeclared identifier
1> missing quotes ("") around 'SA_Yes'?
1>C:\Program Files\Microsoft Visual Studio 9.0\VC\include\excpt.h(63) : error C2337: 'SA_Post' : attribute not found
1>C:\Program Files\Microsoft Visual Studio 9.0\VC\include\excpt.h(63) : error C2065: 'SA_Yes' : undeclared identifier
1> missing quotes ("") around 'SA_Yes'?
1>C:\Program Files\Microsoft Visual Studio 9.0\VC\include\ctype.h(94) : error C2337: 'SA_Post' : attribute not found
1>C:\Program Files\Microsoft Visual Studio 9.0\VC\include\ctype.h(94) : error C2065: 'SA_Yes' : undeclared identifier
1> missing quotes ("") around 'SA_Yes'?
1>C:\Program Files\Microsoft Visual Studio 9.0\VC\include\ctype.h(94) : error C2337: 'SA_Pre' : attribute not found
1>C:\Program Files\Microsoft Visual Studio 9.0\VC\include\ctype.h(94) : error C2065: 'SA_No' : undeclared identifier
1> missing quotes ("") around 'SA_No'?
1>C:\Program Files\Microsoft Visual Studio 9.0\VC\include\ctype.h(94) : error C2337: 'SA_Pre' : attribute not found
1>C:\Program Files\Microsoft Visual Studio 9.0\VC\include\ctype.h(94) : error C2065: 'SA_Yes' : undeclared identifier
1> missing quotes ("") around 'SA_Yes'?
1>C:\Program Files\Microsoft Visual Studio 9.0\VC\include\ctype.h(94) : error C2065: 'SA_Read' : undeclared identifier
1> missing quotes ("") around 'SA_Read'?
1>C:\Program Files\Microsoft Visual Studio 9.0\VC\include\ctype.h(94) : error C2337: 'SA_Pre' : attribute not found
1>C:\Program Files\Microsoft Visual Studio 9.0\VC\include\ctype.h(94) : error C2065: 'SA_No' : undeclared identifier
1> missing quotes ("") around 'SA_No'?
1>C:\Program Files\Microsoft Visual Studio 9.0\VC\include\ctype.h(94) : error C2337: 'SA_Pre' : attribute not found
1>C:\Program Files\Microsoft Visual Studio 9.0\VC\include\ctype.h(94) : error C2065: 'SA_Yes' : undeclared identifier
1> missing quotes ("") around 'SA_Yes'?
1>C:\Program Files\Microsoft Visual Studio 9.0\VC\include\ctype.h(94) : error C2065: 'SA_Read' : undeclared identifier
1> missing quotes ("") around 'SA_Read'?
1>C:\Program Files\Microsoft Visual Studio 9.0\VC\include\ctype.h(95) : error C2337: 'SA_Post' : attribute not found
1>C:\Program Files\Microsoft Visual Studio 9.0\VC\include\ctype.h(95) : error C2065: 'SA_Yes' : undeclared identifier
1> missing quotes ("") around 'SA_Yes'?
1>C:\Program Files\Microsoft Visual Studio 9.0\VC\include\ctype.h(95) : error C2337: 'SA_Pre' : attribute not found
1>C:\Program Files\Microsoft Visual Studio 9.0\VC\include\ctype.h(95) : error C2065: 'SA_No' : undeclared identifier
1> missing quotes ("") around 'SA_No'?
1>C:\Program Files\Microsoft Visual Studio 9.0\VC\include\ctype.h(95) : error C2337: 'SA_Pre' : attribute not found
1>C:\Program Files\Microsoft Visual Studio 9.0\VC\include\ctype.h(95) : error C2065: 'SA_Yes' : undeclared identifier
1> missing quotes ("") around 'SA_Yes'?
1>C:\Program Files\Microsoft Visual Studio 9.0\VC\include\ctype.h(95) : error C2065: 'SA_Read' : undeclared identifier
1> missing quotes ("") around 'SA_Read'?
1>C:\Program Files\Microsoft Visual Studio 9.0\VC\include\ctype.h(95) : error C2337: 'SA_Pre' : attribute not found
1>C:\Program Files\Microsoft Visual Studio 9.0\VC\include\ctype.h(95) : error C2065: 'SA_No' : undeclared identifier
1> missing quotes ("") around 'SA_No'?
1>C:\Program Files\Microsoft Visual Studio 9.0\VC\include\ctype.h(95) : error C2337: 'SA_Pre' : attribute not found
1>C:\Program Files\Microsoft Visual Studio 9.0\VC\include\ctype.h(95) : error C2065: 'SA_Yes' : undeclared identifier
1> missing quotes ("") around 'SA_Yes'?
1>C:\Program Files\Microsoft Visual Studio 9.0\VC\include\ctype.h(95) : error C2065: 'SA_Read' : undeclared identifier
1> missing quotes ("") around 'SA_Read'?
1>C:\Program Files\Microsoft Visual Studio 9.0\VC\include\ctype.h(95) : error C2337: 'SA_Pre' : attribute not found
1>C:\Program Files\Microsoft Visual Studio 9.0\VC\include\ctype.h(95) : error C2065: 'SA_Maybe' : undeclared identifier
1> missing quotes ("") around 'SA_Maybe'?
1>C:\Program Files\Microsoft Visual Studio 9.0\VC\include\ctype.h(95) : error C2337: 'SA_Pre' : attribute not found
1>C:\Program Files\Microsoft Visual Studio 9.0\VC\include\ctype.h(95) : error C2065: 'SA_Yes' : undeclared identifier
1> missing quotes ("") around 'SA_Yes'?
1>C:\Program Files\Microsoft Visual Studio 9.0\VC\include\ctype.h(95) : error C2337: 'SA_Pre' : attribute not found
1>C:\Program Files\Microsoft Visual Studio 9.0\VC\include\ctype.h(95) : error C2065: 'SA_Read' : undeclared identifier
1> missing quotes ("") around 'SA_Read'?
1>C:\Program Files\Microsoft Visual Studio 9.0\VC\include\ctype.h(96) : error C2337: 'SA_Post' : attribute not found
1>C:\Program Files\Microsoft Visual Studio 9.0\VC\include\ctype.h(96) : error C2065: 'SA_Yes' : undeclared identifier
1> missing quotes ("") around 'SA_Yes'?
1>C:\Program Files\Microsoft Visual Studio 9.0\VC\include\ctype.h(96) : error C2337: 'SA_Pre' : attribute not found
1>C:\Program Files\Microsoft Visual Studio 9.0\VC\include\ctype.h(96) : error C2065: 'SA_No' : undeclared identifier
1> missing quotes ("") around 'SA_No'?
1>C:\Program Files\Microsoft Visual Studio 9.0\VC\include\ctype.h(96) : error C2337: 'SA_Pre' : attribute not found
1>C:\Program Files\Microsoft Visual Studio 9.0\VC\include\ctype.h(96) : error C2065: 'SA_Yes' : undeclared identifier
1> missing quotes ("") around 'SA_Yes'?
1>C:\Program Files\Microsoft Visual Studio 9.0\VC\include\ctype.h(96) : error C2065: 'SA_Read' : undeclared identifier
1> missing quotes ("") around 'SA_Read'?
1>C:\Program Files\Microsoft Visual Studio 9.0\VC\include\ctype.h(97) : error C2337: 'SA_Post' : attribute not found
1>C:\Program Files\Microsoft Visual Studio 9.0\VC\include\ctype.h(97) : error C2065: 'SA_Yes' : undeclared identifier
1> missing quotes ("") around 'SA_Yes'?
1>C:\Program Files\Microsoft Visual Studio 9.0\VC\include\ctype.h(97) : error C2337: 'SA_Pre' : attribute not found
1>C:\Program Files\Microsoft Visual Studio 9.0\VC\include\ctype.h(97) : error C2065: 'SA_No' : undeclared identifier
1> missing quotes ("") around 'SA_No'?
1>C:\Program Files\Microsoft Visual Studio 9.0\VC\include\ctype.h(97) : error C2337: 'SA_Pre' : attribute not found
1>C:\Program Files\Microsoft Visual Studio 9.0\VC\include\ctype.h(97) : error C2065: 'SA_Yes' : undeclared identifier
1> missing quotes ("") around 'SA_Yes'?
1>C:\Program Files\Microsoft Visual Studio 9.0\VC\include\ctype.h(97) : error C2065: 'SA_Read' : undeclared identifier
1> missing quotes ("") around 'SA_Read'?
1>C:\Program Files\Microsoft Visual Studio 9.0\VC\include\ctype.h(97) : error C2337: 'SA_Pre' : attribute not found
1>C:\Program Files\Microsoft Visual Studio 9.0\VC\include\ctype.h(97) : error C2065: 'SA_Maybe' : undeclared identifier
1> missing quotes ("") around 'SA_Maybe'?
1>C:\Program Files\Microsoft Visual Studio 9.0\VC\include\ctype.h(97) : error C2337: 'SA_Pre' : attribute not found
1>C:\Program Files\Microsoft Visual Studio 9.0\VC\include\ctype.h(97) : error C2065: 'SA_Yes' : undeclared identifier
1> missing quotes ("") around 'SA_Yes'?
1>C:\Program Files\Microsoft Visual Studio 9.0\VC\include\ctype.h(97) : error C2337: 'SA_Pre' : attribute not found
1>C:\Program Files\Microsoft Visual Studio 9.0\VC\include\ctype.h(97) : error C2065: 'SA_Read' : undeclared identifier
1> missing quotes ("") around 'SA_Read'?
1>C:\Program Files\Microsoft Visual Studio 9.0\VC\include\ctype.h(98) : error C2337: 'SA_Post' : attribute not found
1>C:\Program Files\Microsoft Visual Studio 9.0\VC\include\ctype.h(98) : error C2065: 'SA_Yes' : undeclared identifier
1> missing quotes ("") around 'SA_Yes'?
1>C:\Program Files\Microsoft Visual Studio 9.0\VC\include\ctype.h(98) : error C2337: 'SA_Pre' : attribute not found
1>C:\Program Files\Microsoft Visual Studio 9.0\VC\include\ctype.h(98) : error C2065: 'SA_No' : undeclared identifier
1> missing quotes ("") around 'SA_No'?
1>C:\Program Files\Microsoft Visual Studio 9.0\VC\include\ctype.h(98) : error C2337: 'SA_Pre' : attribute not found
1>C:\Program Files\Microsoft Visual Studio 9.0\VC\include\ctype.h(98) : error C2065: 'SA_Yes' : undeclared identifier
1> missing quotes ("") around 'SA_Yes'?
1>C:\Program Files\Microsoft Visual Studio 9.0\VC\include\ctype.h(98) : error C2065: 'SA_Read' : undeclared identifier
1> missing quotes ("") around 'SA_Read'?
1>C:\Program Files\Microsoft Visual Studio 9.0\VC\include\ctype.h(99) : error C2337: 'SA_Post' : attribute not found
1>C:\Program Files\Microsoft Visual Studio 9.0\VC\include\ctype.h(99) : error C2065: 'SA_Yes' : undeclared identifier
1> missing quotes ("") around 'SA_Yes'?
1>C:\Program Files\Microsoft Visual Studio 9.0\VC\include\ctype.h(99) : error C2337: 'SA_Pre' : attribute not found
1>C:\Program Files\Microsoft Visual Studio 9.0\VC\include\ctype.h(99) : error C2065: 'SA_No' : undeclared identifier
1> missing quotes ("") around 'SA_No'?
1>C:\Program Files\Microsoft Visual Studio 9.0\VC\include\ctype.h(99) : error C2337: 'SA_Pre' : attribute not found
1>C:\Program Files\Microsoft Visual Studio 9.0\VC\include\ctype.h(99) : error C2065: 'SA_Yes' : undeclared identifier
1> missing quotes ("") around 'SA_Yes'?
1>C:\Program Files\Microsoft Visual Studio 9.0\VC\include\ctype.h(99) : error C2065: 'SA_Read' : undeclared identifier
1> missing quotes ("") around 'SA_Read'?
1>C:\Program Files\Microsoft Visual Studio 9.0\VC\include\ctype.h(99) : error C2337: 'SA_Pre' : attribute not found
1>C:\Program Files\Microsoft Visual Studio 9.0\VC\include\ctype.h(99) : error C2065: 'SA_Maybe' : undeclared identifier
1> missing quotes ("") around 'SA_Maybe'?
1>C:\Program Files\Microsoft Visual Studio 9.0\VC\include\ctype.h(99) : error C2337: 'SA_Pre' : attribute not found
1>C:\Program Files\Microsoft Visual Studio 9.0\VC\include\ctype.h(99) : error C2065: 'SA_Yes' : undeclared identifier
1> missing quotes ("") around 'SA_Yes'?
1>C:\Program Files\Microsoft Visual Studio 9.0\VC\include\ctype.h(99) : error C2337: 'SA_Pre' : attribute not found
1>C:\Program Files\Microsoft Visual Studio 9.0\VC\include\ctype.h(99) : error C2065: 'SA_Read' : undeclared identifier
1> missing quotes ("") around 'SA_Read'?
1>C:\Program Files\Microsoft Visual Studio 9.0\VC\include\ctype.h(100) : error C2337: 'SA_Post' : attribute not found
1>C:\Program Files\Microsoft Visual Studio 9.0\VC\include\ctype.h(100) : error C2065: 'SA_Yes' : undeclared identifier
1> missing quotes ("") around 'SA_Yes'?
1>C:\Program Files\Microsoft Visual Studio 9.0\VC\include\ctype.h(100) : error C2337: 'SA_Pre' : attribute not found
1>C:\Program Files\Microsoft Visual Studio 9.0\VC\include\ctype.h(100) : error C2065: 'SA_No' : undeclared identifier
1> missing quotes ("") around 'SA_No'?
1>C:\Program Files\Microsoft Visual Studio 9.0\VC\include\ctype.h(100) : error C2337: 'SA_Pre' : attribute not found
1>C:\Program Files\Microsoft Visual Studio 9.0\VC\include\ctype.h(100) : error C2065: 'SA_Yes' : undeclared identifier
1> missing quotes ("") around 'SA_Yes'?
1>C:\Program Files\Microsoft Visual Studio 9.0\VC\include\ctype.h(100) : error C2065: 'SA_Read' : undeclared identifier
1> missing quotes ("") around 'SA_Read'?
1>C:\Program Files\Microsoft Visual Studio 9.0\VC\include\ctype.h(101) : error C2337: 'SA_Post' : attribute not found
1>C:\Program Files\Microsoft Visual Studio 9.0\VC\include\ctype.h(101) : error C2065: 'SA_Yes' : undeclared identifier
1>C:\Program Files\Microsoft Visual Studio 9.0\VC\include\ctype.h(101) : fatal error C1003: error count exceeds 100; stopping compilation
1>Base.cpp
1>C:\Program Files\Microsoft Visual Studio 9.0\VC\include\excpt.h(60) : error C2337: 'SA_Pre' : attribute not found
1>C:\Program Files\Microsoft Visual Studio 9.0\VC\include\excpt.h(60) : error C2065: 'SA_No' : undeclared identifier
1> missing quotes ("") around 'SA_No'?
1>C:\Program Files\Microsoft Visual Studio 9.0\VC\include\excpt.h(60) : error C2337: 'SA_Pre' : attribute not found
1>C:\Program Files\Microsoft Visual Studio 9.0\VC\include\excpt.h(60) : error C2065: 'SA_Yes' : undeclared identifier
1> missing quotes ("") around 'SA_Yes'?
1>C:\Program Files\Microsoft Visual Studio 9.0\VC\include\excpt.h(60) : error C2065: 'SA_Read' : undeclared identifier
1> missing quotes ("") around 'SA_Read'?
1>C:\Program Files\Microsoft Visual Studio 9.0\VC\include\excpt.h(61) : error C2337: 'SA_Pre' : attribute not found
1>C:\Program Files\Microsoft Visual Studio 9.0\VC\include\excpt.h(61) : error C2065: 'SA_No' : undeclared identifier
1> missing quotes ("") around 'SA_No'?
1>C:\Program Files\Microsoft Visual Studio 9.0\VC\include\excpt.h(61) : error C2337: 'SA_Pre' : attribute not found
1>C:\Program Files\Microsoft Visual Studio 9.0\VC\include\excpt.h(61) : error C2065: 'SA_Yes' : undeclared identifier
1> missing quotes ("") around 'SA_Yes'?
1>C:\Program Files\Microsoft Visual Studio 9.0\VC\include\excpt.h(61) : error C2065: 'SA_Read' : undeclared identifier
1> missing quotes ("") around 'SA_Read'?
1>C:\Program Files\Microsoft Visual Studio 9.0\VC\include\excpt.h(62) : error C2337: 'SA_Pre' : attribute not found
1>C:\Program Files\Microsoft Visual Studio 9.0\VC\include\excpt.h(62) : error C2065: 'SA_No' : undeclared identifier
1> missing quotes ("") around 'SA_No'?
1>C:\Program Files\Microsoft Visual Studio 9.0\VC\include\excpt.h(62) : error C2337: 'SA_Pre' : attribute not found
1>C:\Program Files\Microsoft Visual Studio 9.0\VC\include\excpt.h(62) : error C2065: 'SA_Yes' : undeclared identifier
1> missing quotes ("") around 'SA_Yes'?
1>C:\Program Files\Microsoft Visual Studio 9.0\VC\include\excpt.h(62) : error C2337: 'SA_Post' : attribute not found
1>C:\Program Files\Microsoft Visual Studio 9.0\VC\include\excpt.h(62) : error C2065: 'SA_Yes' : undeclared identifier
1> missing quotes ("") around 'SA_Yes'?
1>C:\Program Files\Microsoft Visual Studio 9.0\VC\include\excpt.h(63) : error C2337: 'SA_Pre' : attribute not found
1>C:\Program Files\Microsoft Visual Studio 9.0\VC\include\excpt.h(63) : error C2065: 'SA_No' : undeclared identifier
1> missing quotes ("") around 'SA_No'?
1>C:\Program Files\Microsoft Visual Studio 9.0\VC\include\excpt.h(63) : error C2337: 'SA_Pre' : attribute not found
1>C:\Program Files\Microsoft Visual Studio 9.0\VC\include\excpt.h(63) : error C2065: 'SA_Yes' : undeclared identifier
1> missing quotes ("") around 'SA_Yes'?
1>C:\Program Files\Microsoft Visual Studio 9.0\VC\include\excpt.h(63) : error C2337: 'SA_Post' : attribute not found
1>C:\Program Files\Microsoft Visual Studio 9.0\VC\include\excpt.h(63) : error C2065: 'SA_Yes' : undeclared identifier
1> missing quotes ("") around 'SA_Yes'?
1>C:\Program Files\Microsoft Visual Studio 9.0\VC\include\ctype.h(94) : error C2337: 'SA_Post' : attribute not found
1>C:\Program Files\Microsoft Visual Studio 9.0\VC\include\ctype.h(94) : error C2065: 'SA_Yes' : undeclared identifier
1> missing quotes ("") around 'SA_Yes'?
1>C:\Program Files\Microsoft Visual Studio 9.0\VC\include\ctype.h(94) : error C2337: 'SA_Pre' : attribute not found
1>C:\Program Files\Microsoft Visual Studio 9.0\VC\include\ctype.h(94) : error C2065: 'SA_No' : undeclared identifier
1> missing quotes ("") around 'SA_No'?
1>C:\Program Files\Microsoft Visual Studio 9.0\VC\include\ctype.h(94) : error C2337: 'SA_Pre' : attribute not found
1>C:\Program Files\Microsoft Visual Studio 9.0\VC\include\ctype.h(94) : error C2065: 'SA_Yes' : undeclared identifier
1> missing quotes ("") around 'SA_Yes'?
1>C:\Program Files\Microsoft Visual Studio 9.0\VC\include\ctype.h(94) : error C2065: 'SA_Read' : undeclared identifier
1> missing quotes ("") around 'SA_Read'?
1>C:\Program Files\Microsoft Visual Studio 9.0\VC\include\ctype.h(94) : error C2337: 'SA_Pre' : attribute not found
1>C:\Program Files\Microsoft Visual Studio 9.0\VC\include\ctype.h(94) : error C2065: 'SA_No' : undeclared identifier
1> missing quotes ("") around 'SA_No'?
1>C:\Program Files\Microsoft Visual Studio 9.0\VC\include\ctype.h(94) : error C2337: 'SA_Pre' : attribute not found
1>C:\Program Files\Microsoft Visual Studio 9.0\VC\include\ctype.h(94) : error C2065: 'SA_Yes' : undeclared identifier
1> missing quotes ("") around 'SA_Yes'?
1>C:\Program Files\Microsoft Visual Studio 9.0\VC\include\ctype.h(94) : error C2065: 'SA_Read' : undeclared identifier
1> missing quotes ("") around 'SA_Read'?
1>C:\Program Files\Microsoft Visual Studio 9.0\VC\include\ctype.h(95) : error C2337: 'SA_Post' : attribute not found
1>C:\Program Files\Microsoft Visual Studio 9.0\VC\include\ctype.h(95) : error C2065: 'SA_Yes' : undeclared identifier
1> missing quotes ("") around 'SA_Yes'?
1>C:\Program Files\Microsoft Visual Studio 9.0\VC\include\ctype.h(95) : error C2337: 'SA_Pre' : attribute not found
1>C:\Program Files\Microsoft Visual Studio 9.0\VC\include\ctype.h(95) : error C2065: 'SA_No' : undeclared identifier
1> missing quotes ("") around 'SA_No'?
1>C:\Program Files\Microsoft Visual Studio 9.0\VC\include\ctype.h(95) : error C2337: 'SA_Pre' : attribute not found
1>C:\Program Files\Microsoft Visual Studio 9.0\VC\include\ctype.h(95) : error C2065: 'SA_Yes' : undeclared identifier
1> missing quotes ("") around 'SA_Yes'?
1>C:\Program Files\Microsoft Visual Studio 9.0\VC\include\ctype.h(95) : error C2065: 'SA_Read' : undeclared identifier
1> missing quotes ("") around 'SA_Read'?
1>C:\Program Files\Microsoft Visual Studio 9.0\VC\include\ctype.h(95) : error C2337: 'SA_Pre' : attribute not found
1>C:\Program Files\Microsoft Visual Studio 9.0\VC\include\ctype.h(95) : error C2065: 'SA_No' : undeclared identifier
1> missing quotes ("") around 'SA_No'?
1>C:\Program Files\Microsoft Visual Studio 9.0\VC\include\ctype.h(95) : error C2337: 'SA_Pre' : attribute not found
1>C:\Program Files\Microsoft Visual Studio 9.0\VC\include\ctype.h(95) : error C2065: 'SA_Yes' : undeclared identifier
1> missing quotes ("") around 'SA_Yes'?
1>C:\Program Files\Microsoft Visual Studio 9.0\VC\include\ctype.h(95) : error C2065: 'SA_Read' : undeclared identifier
1> missing quotes ("") around 'SA_Read'?
1>C:\Program Files\Microsoft Visual Studio 9.0\VC\include\ctype.h(95) : error C2337: 'SA_Pre' : attribute not found
1>C:\Program Files\Microsoft Visual Studio 9.0\VC\include\ctype.h(95) : error C2065: 'SA_Maybe' : undeclared identifier
1> missing quotes ("") around 'SA_Maybe'?
1>C:\Program Files\Microsoft Visual Studio 9.0\VC\include\ctype.h(95) : error C2337: 'SA_Pre' : attribute not found
1>C:\Program Files\Microsoft Visual Studio 9.0\VC\include\ctype.h(95) : error C2065: 'SA_Yes' : undeclared identifier
1> missing quotes ("") around 'SA_Yes'?
1>C:\Program Files\Microsoft Visual Studio 9.0\VC\include\ctype.h(95) : error C2337: 'SA_Pre' : attribute not found
1>C:\Program Files\Microsoft Visual Studio 9.0\VC\include\ctype.h(95) : error C2065: 'SA_Read' : undeclared identifier
1> missing quotes ("") around 'SA_Read'?
1>C:\Program Files\Microsoft Visual Studio 9.0\VC\include\ctype.h(96) : error C2337: 'SA_Post' : attribute not found
1>C:\Program Files\Microsoft Visual Studio 9.0\VC\include\ctype.h(96) : error C2065: 'SA_Yes' : undeclared identifier
1> missing quotes ("") around 'SA_Yes'?
1>C:\Program Files\Microsoft Visual Studio 9.0\VC\include\ctype.h(96) : error C2337: 'SA_Pre' : attribute not found
1>C:\Program Files\Microsoft Visual Studio 9.0\VC\include\ctype.h(96) : error C2065: 'SA_No' : undeclared identifier
1> missing quotes ("") around 'SA_No'?
1>C:\Program Files\Microsoft Visual Studio 9.0\VC\include\ctype.h(96) : error C2337: 'SA_Pre' : attribute not found
1>C:\Program Files\Microsoft Visual Studio 9.0\VC\include\ctype.h(96) : error C2065: 'SA_Yes' : undeclared identifier
1> missing quotes ("") around 'SA_Yes'?
1>C:\Program Files\Microsoft Visual Studio 9.0\VC\include\ctype.h(96) : error C2065: 'SA_Read' : undeclared identifier
1> missing quotes ("") around 'SA_Read'?
1>C:\Program Files\Microsoft Visual Studio 9.0\VC\include\ctype.h(97) : error C2337: 'SA_Post' : attribute not found
1>C:\Program Files\Microsoft Visual Studio 9.0\VC\include\ctype.h(97) : error C2065: 'SA_Yes' : undeclared identifier
1> missing quotes ("") around 'SA_Yes'?
1>C:\Program Files\Microsoft Visual Studio 9.0\VC\include\ctype.h(97) : error C2337: 'SA_Pre' : attribute not found
1>C:\Program Files\Microsoft Visual Studio 9.0\VC\include\ctype.h(97) : error C2065: 'SA_No' : undeclared identifier
1> missing quotes ("") around 'SA_No'?
1>C:\Program Files\Microsoft Visual Studio 9.0\VC\include\ctype.h(97) : error C2337: 'SA_Pre' : attribute not found
1>C:\Program Files\Microsoft Visual Studio 9.0\VC\include\ctype.h(97) : error C2065: 'SA_Yes' : undeclared identifier
1> missing quotes ("") around 'SA_Yes'?
1>C:\Program Files\Microsoft Visual Studio 9.0\VC\include\ctype.h(97) : error C2065: 'SA_Read' : undeclared identifier
1> missing quotes ("") around 'SA_Read'?
1>C:\Program Files\Microsoft Visual Studio 9.0\VC\include\ctype.h(97) : error C2337: 'SA_Pre' : attribute not found
1>C:\Program Files\Microsoft Visual Studio 9.0\VC\include\ctype.h(97) : error C2065: 'SA_Maybe' : undeclared identifier
1> missing quotes ("") around 'SA_Maybe'?
1>C:\Program Files\Microsoft Visual Studio 9.0\VC\include\ctype.h(97) : error C2337: 'SA_Pre' : attribute not found
1>C:\Program Files\Microsoft Visual Studio 9.0\VC\include\ctype.h(97) : error C2065: 'SA_Yes' : undeclared identifier
1> missing quotes ("") around 'SA_Yes'?
1>C:\Program Files\Microsoft Visual Studio 9.0\VC\include\ctype.h(97) : error C2337: 'SA_Pre' : attribute not found
1>C:\Program Files\Microsoft Visual Studio 9.0\VC\include\ctype.h(97) : error C2065: 'SA_Read' : undeclared identifier
1> missing quotes ("") around 'SA_Read'?
1>C:\Program Files\Microsoft Visual Studio 9.0\VC\include\ctype.h(98) : error C2337: 'SA_Post' : attribute not found
1>C:\Program Files\Microsoft Visual Studio 9.0\VC\include\ctype.h(98) : error C2065: 'SA_Yes' : undeclared identifier
1> missing quotes ("") around 'SA_Yes'?
1>C:\Program Files\Microsoft Visual Studio 9.0\VC\include\ctype.h(98) : error C2337: 'SA_Pre' : attribute not found
1>C:\Program Files\Microsoft Visual Studio 9.0\VC\include\ctype.h(98) : error C2065: 'SA_No' : undeclared identifier
1> missing quotes ("") around 'SA_No'?
1>C:\Program Files\Microsoft Visual Studio 9.0\VC\include\ctype.h(98) : error C2337: 'SA_Pre' : attribute not found
1>C:\Program Files\Microsoft Visual Studio 9.0\VC\include\ctype.h(98) : error C2065: 'SA_Yes' : undeclared identifier
1> missing quotes ("") around 'SA_Yes'?
1>C:\Program Files\Microsoft Visual Studio 9.0\VC\include\ctype.h(98) : error C2065: 'SA_Read' : undeclared identifier
1> missing quotes ("") around 'SA_Read'?
1>C:\Program Files\Microsoft Visual Studio 9.0\VC\include\ctype.h(99) : error C2337: 'SA_Post' : attribute not found
1>C:\Program Files\Microsoft Visual Studio 9.0\VC\include\ctype.h(99) : error C2065: 'SA_Yes' : undeclared identifier
1> missing quotes ("") around 'SA_Yes'?
1>C:\Program Files\Microsoft Visual Studio 9.0\VC\include\ctype.h(99) : error C2337: 'SA_Pre' : attribute not found
1>C:\Program Files\Microsoft Visual Studio 9.0\VC\include\ctype.h(99) : error C2065: 'SA_No' : undeclared identifier
1> missing quotes ("") around 'SA_No'?
1>C:\Program Files\Microsoft Visual Studio 9.0\VC\include\ctype.h(99) : error C2337: 'SA_Pre' : attribute not found
1>C:\Program Files\Microsoft Visual Studio 9.0\VC\include\ctype.h(99) : error C2065: 'SA_Yes' : undeclared identifier
1> missing quotes ("") around 'SA_Yes'?
1>C:\Program Files\Microsoft Visual Studio 9.0\VC\include\ctype.h(99) : error C2065: 'SA_Read' : undeclared identifier
1> missing quotes ("") around 'SA_Read'?
1>C:\Program Files\Microsoft Visual Studio 9.0\VC\include\ctype.h(99) : error C2337: 'SA_Pre' : attribute not found
1>C:\Program Files\Microsoft Visual Studio 9.0\VC\include\ctype.h(99) : error C2065: 'SA_Maybe' : undeclared identifier
1> missing quotes ("") around 'SA_Maybe'?
1>C:\Program Files\Microsoft Visual Studio 9.0\VC\include\ctype.h(99) : error C2337: 'SA_Pre' : attribute not found
1>C:\Program Files\Microsoft Visual Studio 9.0\VC\include\ctype.h(99) : error C2065: 'SA_Yes' : undeclared identifier
1> missing quotes ("") around 'SA_Yes'?
1>C:\Program Files\Microsoft Visual Studio 9.0\VC\include\ctype.h(99) : error C2337: 'SA_Pre' : attribute not found
1>C:\Program Files\Microsoft Visual Studio 9.0\VC\include\ctype.h(99) : error C2065: 'SA_Read' : undeclared identifier
1> missing quotes ("") around 'SA_Read'?
1>C:\Program Files\Microsoft Visual Studio 9.0\VC\include\ctype.h(100) : error C2337: 'SA_Post' : attribute not found
1>C:\Program Files\Microsoft Visual Studio 9.0\VC\include\ctype.h(100) : error C2065: 'SA_Yes' : undeclared identifier
1> missing quotes ("") around 'SA_Yes'?
1>C:\Program Files\Microsoft Visual Studio 9.0\VC\include\ctype.h(100) : error C2337: 'SA_Pre' : attribute not found
1>C:\Program Files\Microsoft Visual Studio 9.0\VC\include\ctype.h(100) : error C2065: 'SA_No' : undeclared identifier
1> missing quotes ("") around 'SA_No'?
1>C:\Program Files\Microsoft Visual Studio 9.0\VC\include\ctype.h(100) : error C2337: 'SA_Pre' : attribute not found
1>C:\Program Files\Microsoft Visual Studio 9.0\VC\include\ctype.h(100) : error C2065: 'SA_Yes' : undeclared identifier
1> missing quotes ("") around 'SA_Yes'?
1>C:\Program Files\Microsoft Visual Studio 9.0\VC\include\ctype.h(100) : error C2065: 'SA_Read' : undeclared identifier
1> missing quotes ("") around 'SA_Read'?
1>C:\Program Files\Microsoft Visual Studio 9.0\VC\include\ctype.h(101) : error C2337: 'SA_Post' : attribute not found
1>C:\Program Files\Microsoft Visual Studio 9.0\VC\include\ctype.h(101) : error C2065: 'SA_Yes' : undeclared identifier
1>C:\Program Files\Microsoft Visual Studio 9.0\VC\include\ctype.h(101) : fatal error C1003: error count exceeds 100; stopping compilation
1>Build log was saved at "file://d:\Meus documentos\Programação Combat Arms\CABASE\H3R0 1.0\CABASE\Release\BuildLog.htm"
1>CABASE - 408 error(s), 0 warning(s)
========== Rebuild All: 0 succeeded, 1 failed, 0 skipped ==========
1>------ Rebuild All started: Project: CABASE, Configuration: Release Win32 ------
1>Deleting intermediate and output files for project 'CABASE', configuration 'Release|Win32'
1>Compiling...
1>Menu.cpp
1>C:\Program Files\Microsoft Visual Studio 9.0\VC\include\excpt.h(60) : error C2337: 'SA_Pre' : attribute not found
1>C:\Program Files\Microsoft Visual Studio 9.0\VC\include\excpt.h(60) : error C2065: 'SA_No' : undeclared identifier
1> missing quotes ("") around 'SA_No'?
1>C:\Program Files\Microsoft Visual Studio 9.0\VC\include\excpt.h(60) : error C2337: 'SA_Pre' : attribute not found
1>C:\Program Files\Microsoft Visual Studio 9.0\VC\include\excpt.h(60) : error C2065: 'SA_Yes' : undeclared identifier
1> missing quotes ("") around 'SA_Yes'?
1>C:\Program Files\Microsoft Visual Studio 9.0\VC\include\excpt.h(60) : error C2065: 'SA_Read' : undeclared identifier
1> missing quotes ("") around 'SA_Read'?
1>C:\Program Files\Microsoft Visual Studio 9.0\VC\include\excpt.h(61) : error C2337: 'SA_Pre' : attribute not found
1>C:\Program Files\Microsoft Visual Studio 9.0\VC\include\excpt.h(61) : error C2065: 'SA_No' : undeclared identifier
1> missing quotes ("") around 'SA_No'?
1>C:\Program Files\Microsoft Visual Studio 9.0\VC\include\excpt.h(61) : error C2337: 'SA_Pre' : attribute not found
1>C:\Program Files\Microsoft Visual Studio 9.0\VC\include\excpt.h(61) : error C2065: 'SA_Yes' : undeclared identifier
1> missing quotes ("") around 'SA_Yes'?
1>C:\Program Files\Microsoft Visual Studio 9.0\VC\include\excpt.h(61) : error C2065: 'SA_Read' : undeclared identifier
1> missing quotes ("") around 'SA_Read'?
1>C:\Program Files\Microsoft Visual Studio 9.0\VC\include\excpt.h(62) : error C2337: 'SA_Pre' : attribute not found
1>C:\Program Files\Microsoft Visual Studio 9.0\VC\include\excpt.h(62) : error C2065: 'SA_No' : undeclared identifier
1> missing quotes ("") around 'SA_No'?
1>C:\Program Files\Microsoft Visual Studio 9.0\VC\include\excpt.h(62) : error C2337: 'SA_Pre' : attribute not found
1>C:\Program Files\Microsoft Visual Studio 9.0\VC\include\excpt.h(62) : error C2065: 'SA_Yes' : undeclared identifier
1> missing quotes ("") around 'SA_Yes'?
1>C:\Program Files\Microsoft Visual Studio 9.0\VC\include\excpt.h(62) : error C2337: 'SA_Post' : attribute not found
1>C:\Program Files\Microsoft Visual Studio 9.0\VC\include\excpt.h(62) : error C2065: 'SA_Yes' : undeclared identifier
1> missing quotes ("") around 'SA_Yes'?
1>C:\Program Files\Microsoft Visual Studio 9.0\VC\include\excpt.h(63) : error C2337: 'SA_Pre' : attribute not found
1>C:\Program Files\Microsoft Visual Studio 9.0\VC\include\excpt.h(63) : error C2065: 'SA_No' : undeclared identifier
1> missing quotes ("") around 'SA_No'?
1>C:\Program Files\Microsoft Visual Studio 9.0\VC\include\excpt.h(63) : error C2337: 'SA_Pre' : attribute not found
1>C:\Program Files\Microsoft Visual Studio 9.0\VC\include\excpt.h(63) : error C2065: 'SA_Yes' : undeclared identifier
1> missing quotes ("") around 'SA_Yes'?
1>C:\Program Files\Microsoft Visual Studio 9.0\VC\include\excpt.h(63) : error C2337: 'SA_Post' : attribute not found
1>C:\Program Files\Microsoft Visual Studio 9.0\VC\include\excpt.h(63) : error C2065: 'SA_Yes' : undeclared identifier
1> missing quotes ("") around 'SA_Yes'?
1>C:\Program Files\Microsoft Visual Studio 9.0\VC\include\ctype.h(94) : error C2337: 'SA_Post' : attribute not found
1>C:\Program Files\Microsoft Visual Studio 9.0\VC\include\ctype.h(94) : error C2065: 'SA_Yes' : undeclared identifier
1> missing quotes ("") around 'SA_Yes'?
1>C:\Program Files\Microsoft Visual Studio 9.0\VC\include\ctype.h(94) : error C2337: 'SA_Pre' : attribute not found
1>C:\Program Files\Microsoft Visual Studio 9.0\VC\include\ctype.h(94) : error C2065: 'SA_No' : undeclared identifier
1> missing quotes ("") around 'SA_No'?
1>C:\Program Files\Microsoft Visual Studio 9.0\VC\include\ctype.h(94) : error C2337: 'SA_Pre' : attribute not found
1>C:\Program Files\Microsoft Visual Studio 9.0\VC\include\ctype.h(94) : error C2065: 'SA_Yes' : undeclared identifier
1> missing quotes ("") around 'SA_Yes'?
1>C:\Program Files\Microsoft Visual Studio 9.0\VC\include\ctype.h(94) : error C2065: 'SA_Read' : undeclared identifier
1> missing quotes ("") around 'SA_Read'?
1>C:\Program Files\Microsoft Visual Studio 9.0\VC\include\ctype.h(94) : error C2337: 'SA_Pre' : attribute not found
1>C:\Program Files\Microsoft Visual Studio 9.0\VC\include\ctype.h(94) : error C2065: 'SA_No' : undeclared identifier
1> missing quotes ("") around 'SA_No'?
1>C:\Program Files\Microsoft Visual Studio 9.0\VC\include\ctype.h(94) : error C2337: 'SA_Pre' : attribute not found
1>C:\Program Files\Microsoft Visual Studio 9.0\VC\include\ctype.h(94) : error C2065: 'SA_Yes' : undeclared identifier
1> missing quotes ("") around 'SA_Yes'?
1>C:\Program Files\Microsoft Visual Studio 9.0\VC\include\ctype.h(94) : error C2065: 'SA_Read' : undeclared identifier
1> missing quotes ("") around 'SA_Read'?
1>C:\Program Files\Microsoft Visual Studio 9.0\VC\include\ctype.h(95) : error C2337: 'SA_Post' : attribute not found
1>C:\Program Files\Microsoft Visual Studio 9.0\VC\include\ctype.h(95) : error C2065: 'SA_Yes' : undeclared identifier
1> missing quotes ("") around 'SA_Yes'?
1>C:\Program Files\Microsoft Visual Studio 9.0\VC\include\ctype.h(95) : error C2337: 'SA_Pre' : attribute not found
1>C:\Program Files\Microsoft Visual Studio 9.0\VC\include\ctype.h(95) : error C2065: 'SA_No' : undeclared identifier
1> missing quotes ("") around 'SA_No'?
1>C:\Program Files\Microsoft Visual Studio 9.0\VC\include\ctype.h(95) : error C2337: 'SA_Pre' : attribute not found
1>C:\Program Files\Microsoft Visual Studio 9.0\VC\include\ctype.h(95) : error C2065: 'SA_Yes' : undeclared identifier
1> missing quotes ("") around 'SA_Yes'?
1>C:\Program Files\Microsoft Visual Studio 9.0\VC\include\ctype.h(95) : error C2065: 'SA_Read' : undeclared identifier
1> missing quotes ("") around 'SA_Read'?
1>C:\Program Files\Microsoft Visual Studio 9.0\VC\include\ctype.h(95) : error C2337: 'SA_Pre' : attribute not found
1>C:\Program Files\Microsoft Visual Studio 9.0\VC\include\ctype.h(95) : error C2065: 'SA_No' : undeclared identifier
1> missing quotes ("") around 'SA_No'?
1>C:\Program Files\Microsoft Visual Studio 9.0\VC\include\ctype.h(95) : error C2337: 'SA_Pre' : attribute not found
1>C:\Program Files\Microsoft Visual Studio 9.0\VC\include\ctype.h(95) : error C2065: 'SA_Yes' : undeclared identifier
1> missing quotes ("") around 'SA_Yes'?
1>C:\Program Files\Microsoft Visual Studio 9.0\VC\include\ctype.h(95) : error C2065: 'SA_Read' : undeclared identifier
1> missing quotes ("") around 'SA_Read'?
1>C:\Program Files\Microsoft Visual Studio 9.0\VC\include\ctype.h(95) : error C2337: 'SA_Pre' : attribute not found
1>C:\Program Files\Microsoft Visual Studio 9.0\VC\include\ctype.h(95) : error C2065: 'SA_Maybe' : undeclared identifier
1> missing quotes ("") around 'SA_Maybe'?
1>C:\Program Files\Microsoft Visual Studio 9.0\VC\include\ctype.h(95) : error C2337: 'SA_Pre' : attribute not found
1>C:\Program Files\Microsoft Visual Studio 9.0\VC\include\ctype.h(95) : error C2065: 'SA_Yes' : undeclared identifier
1> missing quotes ("") around 'SA_Yes'?
1>C:\Program Files\Microsoft Visual Studio 9.0\VC\include\ctype.h(95) : error C2337: 'SA_Pre' : attribute not found
1>C:\Program Files\Microsoft Visual Studio 9.0\VC\include\ctype.h(95) : error C2065: 'SA_Read' : undeclared identifier
1> missing quotes ("") around 'SA_Read'?
1>C:\Program Files\Microsoft Visual Studio 9.0\VC\include\ctype.h(96) : error C2337: 'SA_Post' : attribute not found
1>C:\Program Files\Microsoft Visual Studio 9.0\VC\include\ctype.h(96) : error C2065: 'SA_Yes' : undeclared identifier
1> missing quotes ("") around 'SA_Yes'?
1>C:\Program Files\Microsoft Visual Studio 9.0\VC\include\ctype.h(96) : error C2337: 'SA_Pre' : attribute not found
1>C:\Program Files\Microsoft Visual Studio 9.0\VC\include\ctype.h(96) : error C2065: 'SA_No' : undeclared identifier
1> missing quotes ("") around 'SA_No'?
1>C:\Program Files\Microsoft Visual Studio 9.0\VC\include\ctype.h(96) : error C2337: 'SA_Pre' : attribute not found
1>C:\Program Files\Microsoft Visual Studio 9.0\VC\include\ctype.h(96) : error C2065: 'SA_Yes' : undeclared identifier
1> missing quotes ("") around 'SA_Yes'?
1>C:\Program Files\Microsoft Visual Studio 9.0\VC\include\ctype.h(96) : error C2065: 'SA_Read' : undeclared identifier
1> missing quotes ("") around 'SA_Read'?
1>C:\Program Files\Microsoft Visual Studio 9.0\VC\include\ctype.h(97) : error C2337: 'SA_Post' : attribute not found
1>C:\Program Files\Microsoft Visual Studio 9.0\VC\include\ctype.h(97) : error C2065: 'SA_Yes' : undeclared identifier
1> missing quotes ("") around 'SA_Yes'?
1>C:\Program Files\Microsoft Visual Studio 9.0\VC\include\ctype.h(97) : error C2337: 'SA_Pre' : attribute not found
1>C:\Program Files\Microsoft Visual Studio 9.0\VC\include\ctype.h(97) : error C2065: 'SA_No' : undeclared identifier
1> missing quotes ("") around 'SA_No'?
1>C:\Program Files\Microsoft Visual Studio 9.0\VC\include\ctype.h(97) : error C2337: 'SA_Pre' : attribute not found
1>C:\Program Files\Microsoft Visual Studio 9.0\VC\include\ctype.h(97) : error C2065: 'SA_Yes' : undeclared identifier
1> missing quotes ("") around 'SA_Yes'?
1>C:\Program Files\Microsoft Visual Studio 9.0\VC\include\ctype.h(97) : error C2065: 'SA_Read' : undeclared identifier
1> missing quotes ("") around 'SA_Read'?
1>C:\Program Files\Microsoft Visual Studio 9.0\VC\include\ctype.h(97) : error C2337: 'SA_Pre' : attribute not found
1>C:\Program Files\Microsoft Visual Studio 9.0\VC\include\ctype.h(97) : error C2065: 'SA_Maybe' : undeclared identifier
1> missing quotes ("") around 'SA_Maybe'?
1>C:\Program Files\Microsoft Visual Studio 9.0\VC\include\ctype.h(97) : error C2337: 'SA_Pre' : attribute not found
1>C:\Program Files\Microsoft Visual Studio 9.0\VC\include\ctype.h(97) : error C2065: 'SA_Yes' : undeclared identifier
1> missing quotes ("") around 'SA_Yes'?
1>C:\Program Files\Microsoft Visual Studio 9.0\VC\include\ctype.h(97) : error C2337: 'SA_Pre' : attribute not found
1>C:\Program Files\Microsoft Visual Studio 9.0\VC\include\ctype.h(97) : error C2065: 'SA_Read' : undeclared identifier
1> missing quotes ("") around 'SA_Read'?
1>C:\Program Files\Microsoft Visual Studio 9.0\VC\include\ctype.h(98) : error C2337: 'SA_Post' : attribute not found
1>C:\Program Files\Microsoft Visual Studio 9.0\VC\include\ctype.h(98) : error C2065: 'SA_Yes' : undeclared identifier
1> missing quotes ("") around 'SA_Yes'?
1>C:\Program Files\Microsoft Visual Studio 9.0\VC\include\ctype.h(98) : error C2337: 'SA_Pre' : attribute not found
1>C:\Program Files\Microsoft Visual Studio 9.0\VC\include\ctype.h(98) : error C2065: 'SA_No' : undeclared identifier
1> missing quotes ("") around 'SA_No'?
1>C:\Program Files\Microsoft Visual Studio 9.0\VC\include\ctype.h(98) : error C2337: 'SA_Pre' : attribute not found
1>C:\Program Files\Microsoft Visual Studio 9.0\VC\include\ctype.h(98) : error C2065: 'SA_Yes' : undeclared identifier
1> missing quotes ("") around 'SA_Yes'?
1>C:\Program Files\Microsoft Visual Studio 9.0\VC\include\ctype.h(98) : error C2065: 'SA_Read' : undeclared identifier
1> missing quotes ("") around 'SA_Read'?
1>C:\Program Files\Microsoft Visual Studio 9.0\VC\include\ctype.h(99) : error C2337: 'SA_Post' : attribute not found
1>C:\Program Files\Microsoft Visual Studio 9.0\VC\include\ctype.h(99) : error C2065: 'SA_Yes' : undeclared identifier
1> missing quotes ("") around 'SA_Yes'?
1>C:\Program Files\Microsoft Visual Studio 9.0\VC\include\ctype.h(99) : error C2337: 'SA_Pre' : attribute not found
1>C:\Program Files\Microsoft Visual Studio 9.0\VC\include\ctype.h(99) : error C2065: 'SA_No' : undeclared identifier
1> missing quotes ("") around 'SA_No'?
1>C:\Program Files\Microsoft Visual Studio 9.0\VC\include\ctype.h(99) : error C2337: 'SA_Pre' : attribute not found
1>C:\Program Files\Microsoft Visual Studio 9.0\VC\include\ctype.h(99) : error C2065: 'SA_Yes' : undeclared identifier
1> missing quotes ("") around 'SA_Yes'?
1>C:\Program Files\Microsoft Visual Studio 9.0\VC\include\ctype.h(99) : error C2065: 'SA_Read' : undeclared identifier
1> missing quotes ("") around 'SA_Read'?
1>C:\Program Files\Microsoft Visual Studio 9.0\VC\include\ctype.h(99) : error C2337: 'SA_Pre' : attribute not found
1>C:\Program Files\Microsoft Visual Studio 9.0\VC\include\ctype.h(99) : error C2065: 'SA_Maybe' : undeclared identifier
1> missing quotes ("") around 'SA_Maybe'?
1>C:\Program Files\Microsoft Visual Studio 9.0\VC\include\ctype.h(99) : error C2337: 'SA_Pre' : attribute not found
1>C:\Program Files\Microsoft Visual Studio 9.0\VC\include\ctype.h(99) : error C2065: 'SA_Yes' : undeclared identifier
1> missing quotes ("") around 'SA_Yes'?
1>C:\Program Files\Microsoft Visual Studio 9.0\VC\include\ctype.h(99) : error C2337: 'SA_Pre' : attribute not found
1>C:\Program Files\Microsoft Visual Studio 9.0\VC\include\ctype.h(99) : error C2065: 'SA_Read' : undeclared identifier
1> missing quotes ("") around 'SA_Read'?
1>C:\Program Files\Microsoft Visual Studio 9.0\VC\include\ctype.h(100) : error C2337: 'SA_Post' : attribute not found
1>C:\Program Files\Microsoft Visual Studio 9.0\VC\include\ctype.h(100) : error C2065: 'SA_Yes' : undeclared identifier
1> missing quotes ("") around 'SA_Yes'?
1>C:\Program Files\Microsoft Visual Studio 9.0\VC\include\ctype.h(100) : error C2337: 'SA_Pre' : attribute not found
1>C:\Program Files\Microsoft Visual Studio 9.0\VC\include\ctype.h(100) : error C2065: 'SA_No' : undeclared identifier
1> missing quotes ("") around 'SA_No'?
1>C:\Program Files\Microsoft Visual Studio 9.0\VC\include\ctype.h(100) : error C2337: 'SA_Pre' : attribute not found
1>C:\Program Files\Microsoft Visual Studio 9.0\VC\include\ctype.h(100) : error C2065: 'SA_Yes' : undeclared identifier
1> missing quotes ("") around 'SA_Yes'?
1>C:\Program Files\Microsoft Visual Studio 9.0\VC\include\ctype.h(100) : error C2065: 'SA_Read' : undeclared identifier
1> missing quotes ("") around 'SA_Read'?
1>C:\Program Files\Microsoft Visual Studio 9.0\VC\include\ctype.h(101) : error C2337: 'SA_Post' : attribute not found
1>C:\Program Files\Microsoft Visual Studio 9.0\VC\include\ctype.h(101) : error C2065: 'SA_Yes' : undeclared identifier
1>C:\Program Files\Microsoft Visual Studio 9.0\VC\include\ctype.h(101) : fatal error C1003: error count exceeds 100; stopping compilation
1>DirectX.cpp
1>C:\Program Files\Microsoft Visual Studio 9.0\VC\include\excpt.h(60) : error C2337: 'SA_Pre' : attribute not found
1>C:\Program Files\Microsoft Visual Studio 9.0\VC\include\excpt.h(60) : error C2065: 'SA_No' : undeclared identifier
1> missing quotes ("") around 'SA_No'?
1>C:\Program Files\Microsoft Visual Studio 9.0\VC\include\excpt.h(60) : error C2337: 'SA_Pre' : attribute not found
1>C:\Program Files\Microsoft Visual Studio 9.0\VC\include\excpt.h(60) : error C2065: 'SA_Yes' : undeclared identifier
1> missing quotes ("") around 'SA_Yes'?
1>C:\Program Files\Microsoft Visual Studio 9.0\VC\include\excpt.h(60) : error C2065: 'SA_Read' : undeclared identifier
1> missing quotes ("") around 'SA_Read'?
1>C:\Program Files\Microsoft Visual Studio 9.0\VC\include\excpt.h(61) : error C2337: 'SA_Pre' : attribute not found
1>C:\Program Files\Microsoft Visual Studio 9.0\VC\include\excpt.h(61) : error C2065: 'SA_No' : undeclared identifier
1> missing quotes ("") around 'SA_No'?
1>C:\Program Files\Microsoft Visual Studio 9.0\VC\include\excpt.h(61) : error C2337: 'SA_Pre' : attribute not found
1>C:\Program Files\Microsoft Visual Studio 9.0\VC\include\excpt.h(61) : error C2065: 'SA_Yes' : undeclared identifier
1> missing quotes ("") around 'SA_Yes'?
1>C:\Program Files\Microsoft Visual Studio 9.0\VC\include\excpt.h(61) : error C2065: 'SA_Read' : undeclared identifier
1> missing quotes ("") around 'SA_Read'?
1>C:\Program Files\Microsoft Visual Studio 9.0\VC\include\excpt.h(62) : error C2337: 'SA_Pre' : attribute not found
1>C:\Program Files\Microsoft Visual Studio 9.0\VC\include\excpt.h(62) : error C2065: 'SA_No' : undeclared identifier
1> missing quotes ("") around 'SA_No'?
1>C:\Program Files\Microsoft Visual Studio 9.0\VC\include\excpt.h(62) : error C2337: 'SA_Pre' : attribute not found
1>C:\Program Files\Microsoft Visual Studio 9.0\VC\include\excpt.h(62) : error C2065: 'SA_Yes' : undeclared identifier
1> missing quotes ("") around 'SA_Yes'?
1>C:\Program Files\Microsoft Visual Studio 9.0\VC\include\excpt.h(62) : error C2337: 'SA_Post' : attribute not found
1>C:\Program Files\Microsoft Visual Studio 9.0\VC\include\excpt.h(62) : error C2065: 'SA_Yes' : undeclared identifier
1> missing quotes ("") around 'SA_Yes'?
1>C:\Program Files\Microsoft Visual Studio 9.0\VC\include\excpt.h(63) : error C2337: 'SA_Pre' : attribute not found
1>C:\Program Files\Microsoft Visual Studio 9.0\VC\include\excpt.h(63) : error C2065: 'SA_No' : undeclared identifier
1> missing quotes ("") around 'SA_No'?
1>C:\Program Files\Microsoft Visual Studio 9.0\VC\include\excpt.h(63) : error C2337: 'SA_Pre' : attribute not found
1>C:\Program Files\Microsoft Visual Studio 9.0\VC\include\excpt.h(63) : error C2065: 'SA_Yes' : undeclared identifier
1> missing quotes ("") around 'SA_Yes'?
1>C:\Program Files\Microsoft Visual Studio 9.0\VC\include\excpt.h(63) : error C2337: 'SA_Post' : attribute not found
1>C:\Program Files\Microsoft Visual Studio 9.0\VC\include\excpt.h(63) : error C2065: 'SA_Yes' : undeclared identifier
1> missing quotes ("") around 'SA_Yes'?
1>C:\Program Files\Microsoft Visual Studio 9.0\VC\include\ctype.h(94) : error C2337: 'SA_Post' : attribute not found
1>C:\Program Files\Microsoft Visual Studio 9.0\VC\include\ctype.h(94) : error C2065: 'SA_Yes' : undeclared identifier
1> missing quotes ("") around 'SA_Yes'?
1>C:\Program Files\Microsoft Visual Studio 9.0\VC\include\ctype.h(94) : error C2337: 'SA_Pre' : attribute not found
1>C:\Program Files\Microsoft Visual Studio 9.0\VC\include\ctype.h(94) : error C2065: 'SA_No' : undeclared identifier
1> missing quotes ("") around 'SA_No'?
1>C:\Program Files\Microsoft Visual Studio 9.0\VC\include\ctype.h(94) : error C2337: 'SA_Pre' : attribute not found
1>C:\Program Files\Microsoft Visual Studio 9.0\VC\include\ctype.h(94) : error C2065: 'SA_Yes' : undeclared identifier
1> missing quotes ("") around 'SA_Yes'?
1>C:\Program Files\Microsoft Visual Studio 9.0\VC\include\ctype.h(94) : error C2065: 'SA_Read' : undeclared identifier
1> missing quotes ("") around 'SA_Read'?
1>C:\Program Files\Microsoft Visual Studio 9.0\VC\include\ctype.h(94) : error C2337: 'SA_Pre' : attribute not found
1>C:\Program Files\Microsoft Visual Studio 9.0\VC\include\ctype.h(94) : error C2065: 'SA_No' : undeclared identifier
1> missing quotes ("") around 'SA_No'?
1>C:\Program Files\Microsoft Visual Studio 9.0\VC\include\ctype.h(94) : error C2337: 'SA_Pre' : attribute not found
1>C:\Program Files\Microsoft Visual Studio 9.0\VC\include\ctype.h(94) : error C2065: 'SA_Yes' : undeclared identifier
1> missing quotes ("") around 'SA_Yes'?
1>C:\Program Files\Microsoft Visual Studio 9.0\VC\include\ctype.h(94) : error C2065: 'SA_Read' : undeclared identifier
1> missing quotes ("") around 'SA_Read'?
1>C:\Program Files\Microsoft Visual Studio 9.0\VC\include\ctype.h(95) : error C2337: 'SA_Post' : attribute not found
1>C:\Program Files\Microsoft Visual Studio 9.0\VC\include\ctype.h(95) : error C2065: 'SA_Yes' : undeclared identifier
1> missing quotes ("") around 'SA_Yes'?
1>C:\Program Files\Microsoft Visual Studio 9.0\VC\include\ctype.h(95) : error C2337: 'SA_Pre' : attribute not found
1>C:\Program Files\Microsoft Visual Studio 9.0\VC\include\ctype.h(95) : error C2065: 'SA_No' : undeclared identifier
1> missing quotes ("") around 'SA_No'?
1>C:\Program Files\Microsoft Visual Studio 9.0\VC\include\ctype.h(95) : error C2337: 'SA_Pre' : attribute not found
1>C:\Program Files\Microsoft Visual Studio 9.0\VC\include\ctype.h(95) : error C2065: 'SA_Yes' : undeclared identifier
1> missing quotes ("") around 'SA_Yes'?
1>C:\Program Files\Microsoft Visual Studio 9.0\VC\include\ctype.h(95) : error C2065: 'SA_Read' : undeclared identifier
1> missing quotes ("") around 'SA_Read'?
1>C:\Program Files\Microsoft Visual Studio 9.0\VC\include\ctype.h(95) : error C2337: 'SA_Pre' : attribute not found
1>C:\Program Files\Microsoft Visual Studio 9.0\VC\include\ctype.h(95) : error C2065: 'SA_No' : undeclared identifier
1> missing quotes ("") around 'SA_No'?
1>C:\Program Files\Microsoft Visual Studio 9.0\VC\include\ctype.h(95) : error C2337: 'SA_Pre' : attribute not found
1>C:\Program Files\Microsoft Visual Studio 9.0\VC\include\ctype.h(95) : error C2065: 'SA_Yes' : undeclared identifier
1> missing quotes ("") around 'SA_Yes'?
1>C:\Program Files\Microsoft Visual Studio 9.0\VC\include\ctype.h(95) : error C2065: 'SA_Read' : undeclared identifier
1> missing quotes ("") around 'SA_Read'?
1>C:\Program Files\Microsoft Visual Studio 9.0\VC\include\ctype.h(95) : error C2337: 'SA_Pre' : attribute not found
1>C:\Program Files\Microsoft Visual Studio 9.0\VC\include\ctype.h(95) : error C2065: 'SA_Maybe' : undeclared identifier
1> missing quotes ("") around 'SA_Maybe'?
1>C:\Program Files\Microsoft Visual Studio 9.0\VC\include\ctype.h(95) : error C2337: 'SA_Pre' : attribute not found
1>C:\Program Files\Microsoft Visual Studio 9.0\VC\include\ctype.h(95) : error C2065: 'SA_Yes' : undeclared identifier
1> missing quotes ("") around 'SA_Yes'?
1>C:\Program Files\Microsoft Visual Studio 9.0\VC\include\ctype.h(95) : error C2337: 'SA_Pre' : attribute not found
1>C:\Program Files\Microsoft Visual Studio 9.0\VC\include\ctype.h(95) : error C2065: 'SA_Read' : undeclared identifier
1> missing quotes ("") around 'SA_Read'?
1>C:\Program Files\Microsoft Visual Studio 9.0\VC\include\ctype.h(96) : error C2337: 'SA_Post' : attribute not found
1>C:\Program Files\Microsoft Visual Studio 9.0\VC\include\ctype.h(96) : error C2065: 'SA_Yes' : undeclared identifier
1> missing quotes ("") around 'SA_Yes'?
1>C:\Program Files\Microsoft Visual Studio 9.0\VC\include\ctype.h(96) : error C2337: 'SA_Pre' : attribute not found
1>C:\Program Files\Microsoft Visual Studio 9.0\VC\include\ctype.h(96) : error C2065: 'SA_No' : undeclared identifier
1> missing quotes ("") around 'SA_No'?
1>C:\Program Files\Microsoft Visual Studio 9.0\VC\include\ctype.h(96) : error C2337: 'SA_Pre' : attribute not found
1>C:\Program Files\Microsoft Visual Studio 9.0\VC\include\ctype.h(96) : error C2065: 'SA_Yes' : undeclared identifier
1> missing quotes ("") around 'SA_Yes'?
1>C:\Program Files\Microsoft Visual Studio 9.0\VC\include\ctype.h(96) : error C2065: 'SA_Read' : undeclared identifier
1> missing quotes ("") around 'SA_Read'?
1>C:\Program Files\Microsoft Visual Studio 9.0\VC\include\ctype.h(97) : error C2337: 'SA_Post' : attribute not found
1>C:\Program Files\Microsoft Visual Studio 9.0\VC\include\ctype.h(97) : error C2065: 'SA_Yes' : undeclared identifier
1> missing quotes ("") around 'SA_Yes'?
1>C:\Program Files\Microsoft Visual Studio 9.0\VC\include\ctype.h(97) : error C2337: 'SA_Pre' : attribute not found
1>C:\Program Files\Microsoft Visual Studio 9.0\VC\include\ctype.h(97) : error C2065: 'SA_No' : undeclared identifier
1> missing quotes ("") around 'SA_No'?
1>C:\Program Files\Microsoft Visual Studio 9.0\VC\include\ctype.h(97) : error C2337: 'SA_Pre' : attribute not found
1>C:\Program Files\Microsoft Visual Studio 9.0\VC\include\ctype.h(97) : error C2065: 'SA_Yes' : undeclared identifier
1> missing quotes ("") around 'SA_Yes'?
1>C:\Program Files\Microsoft Visual Studio 9.0\VC\include\ctype.h(97) : error C2065: 'SA_Read' : undeclared identifier
1> missing quotes ("") around 'SA_Read'?
1>C:\Program Files\Microsoft Visual Studio 9.0\VC\include\ctype.h(97) : error C2337: 'SA_Pre' : attribute not found
1>C:\Program Files\Microsoft Visual Studio 9.0\VC\include\ctype.h(97) : error C2065: 'SA_Maybe' : undeclared identifier
1> missing quotes ("") around 'SA_Maybe'?
1>C:\Program Files\Microsoft Visual Studio 9.0\VC\include\ctype.h(97) : error C2337: 'SA_Pre' : attribute not found
1>C:\Program Files\Microsoft Visual Studio 9.0\VC\include\ctype.h(97) : error C2065: 'SA_Yes' : undeclared identifier
1> missing quotes ("") around 'SA_Yes'?
1>C:\Program Files\Microsoft Visual Studio 9.0\VC\include\ctype.h(97) : error C2337: 'SA_Pre' : attribute not found
1>C:\Program Files\Microsoft Visual Studio 9.0\VC\include\ctype.h(97) : error C2065: 'SA_Read' : undeclared identifier
1> missing quotes ("") around 'SA_Read'?
1>C:\Program Files\Microsoft Visual Studio 9.0\VC\include\ctype.h(98) : error C2337: 'SA_Post' : attribute not found
1>C:\Program Files\Microsoft Visual Studio 9.0\VC\include\ctype.h(98) : error C2065: 'SA_Yes' : undeclared identifier
1> missing quotes ("") around 'SA_Yes'?
1>C:\Program Files\Microsoft Visual Studio 9.0\VC\include\ctype.h(98) : error C2337: 'SA_Pre' : attribute not found
1>C:\Program Files\Microsoft Visual Studio 9.0\VC\include\ctype.h(98) : error C2065: 'SA_No' : undeclared identifier
1> missing quotes ("") around 'SA_No'?
1>C:\Program Files\Microsoft Visual Studio 9.0\VC\include\ctype.h(98) : error C2337: 'SA_Pre' : attribute not found
1>C:\Program Files\Microsoft Visual Studio 9.0\VC\include\ctype.h(98) : error C2065: 'SA_Yes' : undeclared identifier
1> missing quotes ("") around 'SA_Yes'?
1>C:\Program Files\Microsoft Visual Studio 9.0\VC\include\ctype.h(98) : error C2065: 'SA_Read' : undeclared identifier
1> missing quotes ("") around 'SA_Read'?
1>C:\Program Files\Microsoft Visual Studio 9.0\VC\include\ctype.h(99) : error C2337: 'SA_Post' : attribute not found
1>C:\Program Files\Microsoft Visual Studio 9.0\VC\include\ctype.h(99) : error C2065: 'SA_Yes' : undeclared identifier
1> missing quotes ("") around 'SA_Yes'?
1>C:\Program Files\Microsoft Visual Studio 9.0\VC\include\ctype.h(99) : error C2337: 'SA_Pre' : attribute not found
1>C:\Program Files\Microsoft Visual Studio 9.0\VC\include\ctype.h(99) : error C2065: 'SA_No' : undeclared identifier
1> missing quotes ("") around 'SA_No'?
1>C:\Program Files\Microsoft Visual Studio 9.0\VC\include\ctype.h(99) : error C2337: 'SA_Pre' : attribute not found
1>C:\Program Files\Microsoft Visual Studio 9.0\VC\include\ctype.h(99) : error C2065: 'SA_Yes' : undeclared identifier
1> missing quotes ("") around 'SA_Yes'?
1>C:\Program Files\Microsoft Visual Studio 9.0\VC\include\ctype.h(99) : error C2065: 'SA_Read' : undeclared identifier
1> missing quotes ("") around 'SA_Read'?
1>C:\Program Files\Microsoft Visual Studio 9.0\VC\include\ctype.h(99) : error C2337: 'SA_Pre' : attribute not found
1>C:\Program Files\Microsoft Visual Studio 9.0\VC\include\ctype.h(99) : error C2065: 'SA_Maybe' : undeclared identifier
1> missing quotes ("") around 'SA_Maybe'?
1>C:\Program Files\Microsoft Visual Studio 9.0\VC\include\ctype.h(99) : error C2337: 'SA_Pre' : attribute not found
1>C:\Program Files\Microsoft Visual Studio 9.0\VC\include\ctype.h(99) : error C2065: 'SA_Yes' : undeclared identifier
1> missing quotes ("") around 'SA_Yes'?
1>C:\Program Files\Microsoft Visual Studio 9.0\VC\include\ctype.h(99) : error C2337: 'SA_Pre' : attribute not found
1>C:\Program Files\Microsoft Visual Studio 9.0\VC\include\ctype.h(99) : error C2065: 'SA_Read' : undeclared identifier
1> missing quotes ("") around 'SA_Read'?
1>C:\Program Files\Microsoft Visual Studio 9.0\VC\include\ctype.h(100) : error C2337: 'SA_Post' : attribute not found
1>C:\Program Files\Microsoft Visual Studio 9.0\VC\include\ctype.h(100) : error C2065: 'SA_Yes' : undeclared identifier
1> missing quotes ("") around 'SA_Yes'?
1>C:\Program Files\Microsoft Visual Studio 9.0\VC\include\ctype.h(100) : error C2337: 'SA_Pre' : attribute not found
1>C:\Program Files\Microsoft Visual Studio 9.0\VC\include\ctype.h(100) : error C2065: 'SA_No' : undeclared identifier
1> missing quotes ("") around 'SA_No'?
1>C:\Program Files\Microsoft Visual Studio 9.0\VC\include\ctype.h(100) : error C2337: 'SA_Pre' : attribute not found
1>C:\Program Files\Microsoft Visual Studio 9.0\VC\include\ctype.h(100) : error C2065: 'SA_Yes' : undeclared identifier
1> missing quotes ("") around 'SA_Yes'?
1>C:\Program Files\Microsoft Visual Studio 9.0\VC\include\ctype.h(100) : error C2065: 'SA_Read' : undeclared identifier
1> missing quotes ("") around 'SA_Read'?
1>C:\Program Files\Microsoft Visual Studio 9.0\VC\include\ctype.h(101) : error C2337: 'SA_Post' : attribute not found
1>C:\Program Files\Microsoft Visual Studio 9.0\VC\include\ctype.h(101) : error C2065: 'SA_Yes' : undeclared identifier
1>C:\Program Files\Microsoft Visual Studio 9.0\VC\include\ctype.h(101) : fatal error C1003: error count exceeds 100; stopping compilation
1>detours.cpp
1>C:\Program Files\Microsoft Visual Studio 9.0\VC\include\excpt.h(60) : error C2337: 'SA_Pre' : attribute not found
1>C:\Program Files\Microsoft Visual Studio 9.0\VC\include\excpt.h(60) : error C2065: 'SA_No' : undeclared identifier
1> missing quotes ("") around 'SA_No'?
1>C:\Program Files\Microsoft Visual Studio 9.0\VC\include\excpt.h(60) : error C2337: 'SA_Pre' : attribute not found
1>C:\Program Files\Microsoft Visual Studio 9.0\VC\include\excpt.h(60) : error C2065: 'SA_Yes' : undeclared identifier
1> missing quotes ("") around 'SA_Yes'?
1>C:\Program Files\Microsoft Visual Studio 9.0\VC\include\excpt.h(60) : error C2065: 'SA_Read' : undeclared identifier
1> missing quotes ("") around 'SA_Read'?
1>C:\Program Files\Microsoft Visual Studio 9.0\VC\include\excpt.h(61) : error C2337: 'SA_Pre' : attribute not found
1>C:\Program Files\Microsoft Visual Studio 9.0\VC\include\excpt.h(61) : error C2065: 'SA_No' : undeclared identifier
1> missing quotes ("") around 'SA_No'?
1>C:\Program Files\Microsoft Visual Studio 9.0\VC\include\excpt.h(61) : error C2337: 'SA_Pre' : attribute not found
1>C:\Program Files\Microsoft Visual Studio 9.0\VC\include\excpt.h(61) : error C2065: 'SA_Yes' : undeclared identifier
1> missing quotes ("") around 'SA_Yes'?
1>C:\Program Files\Microsoft Visual Studio 9.0\VC\include\excpt.h(61) : error C2065: 'SA_Read' : undeclared identifier
1> missing quotes ("") around 'SA_Read'?
1>C:\Program Files\Microsoft Visual Studio 9.0\VC\include\excpt.h(62) : error C2337: 'SA_Pre' : attribute not found
1>C:\Program Files\Microsoft Visual Studio 9.0\VC\include\excpt.h(62) : error C2065: 'SA_No' : undeclared identifier
1> missing quotes ("") around 'SA_No'?
1>C:\Program Files\Microsoft Visual Studio 9.0\VC\include\excpt.h(62) : error C2337: 'SA_Pre' : attribute not found
1>C:\Program Files\Microsoft Visual Studio 9.0\VC\include\excpt.h(62) : error C2065: 'SA_Yes' : undeclared identifier
1> missing quotes ("") around 'SA_Yes'?
1>C:\Program Files\Microsoft Visual Studio 9.0\VC\include\excpt.h(62) : error C2337: 'SA_Post' : attribute not found
1>C:\Program Files\Microsoft Visual Studio 9.0\VC\include\excpt.h(62) : error C2065: 'SA_Yes' : undeclared identifier
1> missing quotes ("") around 'SA_Yes'?
1>C:\Program Files\Microsoft Visual Studio 9.0\VC\include\excpt.h(63) : error C2337: 'SA_Pre' : attribute not found
1>C:\Program Files\Microsoft Visual Studio 9.0\VC\include\excpt.h(63) : error C2065: 'SA_No' : undeclared identifier
1> missing quotes ("") around 'SA_No'?
1>C:\Program Files\Microsoft Visual Studio 9.0\VC\include\excpt.h(63) : error C2337: 'SA_Pre' : attribute not found
1>C:\Program Files\Microsoft Visual Studio 9.0\VC\include\excpt.h(63) : error C2065: 'SA_Yes' : undeclared identifier
1> missing quotes ("") around 'SA_Yes'?
1>C:\Program Files\Microsoft Visual Studio 9.0\VC\include\excpt.h(63) : error C2337: 'SA_Post' : attribute not found
1>C:\Program Files\Microsoft Visual Studio 9.0\VC\include\excpt.h(63) : error C2065: 'SA_Yes' : undeclared identifier
1> missing quotes ("") around 'SA_Yes'?
1>C:\Program Files\Microsoft Visual Studio 9.0\VC\include\ctype.h(94) : error C2337: 'SA_Post' : attribute not found
1>C:\Program Files\Microsoft Visual Studio 9.0\VC\include\ctype.h(94) : error C2065: 'SA_Yes' : undeclared identifier
1> missing quotes ("") around 'SA_Yes'?
1>C:\Program Files\Microsoft Visual Studio 9.0\VC\include\ctype.h(94) : error C2337: 'SA_Pre' : attribute not found
1>C:\Program Files\Microsoft Visual Studio 9.0\VC\include\ctype.h(94) : error C2065: 'SA_No' : undeclared identifier
1> missing quotes ("") around 'SA_No'?
1>C:\Program Files\Microsoft Visual Studio 9.0\VC\include\ctype.h(94) : error C2337: 'SA_Pre' : attribute not found
1>C:\Program Files\Microsoft Visual Studio 9.0\VC\include\ctype.h(94) : error C2065: 'SA_Yes' : undeclared identifier
1> missing quotes ("") around 'SA_Yes'?
1>C:\Program Files\Microsoft Visual Studio 9.0\VC\include\ctype.h(94) : error C2065: 'SA_Read' : undeclared identifier
1> missing quotes ("") around 'SA_Read'?
1>C:\Program Files\Microsoft Visual Studio 9.0\VC\include\ctype.h(94) : error C2337: 'SA_Pre' : attribute not found
1>C:\Program Files\Microsoft Visual Studio 9.0\VC\include\ctype.h(94) : error C2065: 'SA_No' : undeclared identifier
1> missing quotes ("") around 'SA_No'?
1>C:\Program Files\Microsoft Visual Studio 9.0\VC\include\ctype.h(94) : error C2337: 'SA_Pre' : attribute not found
1>C:\Program Files\Microsoft Visual Studio 9.0\VC\include\ctype.h(94) : error C2065: 'SA_Yes' : undeclared identifier
1> missing quotes ("") around 'SA_Yes'?
1>C:\Program Files\Microsoft Visual Studio 9.0\VC\include\ctype.h(94) : error C2065: 'SA_Read' : undeclared identifier
1> missing quotes ("") around 'SA_Read'?
1>C:\Program Files\Microsoft Visual Studio 9.0\VC\include\ctype.h(95) : error C2337: 'SA_Post' : attribute not found
1>C:\Program Files\Microsoft Visual Studio 9.0\VC\include\ctype.h(95) : error C2065: 'SA_Yes' : undeclared identifier
1> missing quotes ("") around 'SA_Yes'?
1>C:\Program Files\Microsoft Visual Studio 9.0\VC\include\ctype.h(95) : error C2337: 'SA_Pre' : attribute not found
1>C:\Program Files\Microsoft Visual Studio 9.0\VC\include\ctype.h(95) : error C2065: 'SA_No' : undeclared identifier
1> missing quotes ("") around 'SA_No'?
1>C:\Program Files\Microsoft Visual Studio 9.0\VC\include\ctype.h(95) : error C2337: 'SA_Pre' : attribute not found
1>C:\Program Files\Microsoft Visual Studio 9.0\VC\include\ctype.h(95) : error C2065: 'SA_Yes' : undeclared identifier
1> missing quotes ("") around 'SA_Yes'?
1>C:\Program Files\Microsoft Visual Studio 9.0\VC\include\ctype.h(95) : error C2065: 'SA_Read' : undeclared identifier
1> missing quotes ("") around 'SA_Read'?
1>C:\Program Files\Microsoft Visual Studio 9.0\VC\include\ctype.h(95) : error C2337: 'SA_Pre' : attribute not found
1>C:\Program Files\Microsoft Visual Studio 9.0\VC\include\ctype.h(95) : error C2065: 'SA_No' : undeclared identifier
1> missing quotes ("") around 'SA_No'?
1>C:\Program Files\Microsoft Visual Studio 9.0\VC\include\ctype.h(95) : error C2337: 'SA_Pre' : attribute not found
1>C:\Program Files\Microsoft Visual Studio 9.0\VC\include\ctype.h(95) : error C2065: 'SA_Yes' : undeclared identifier
1> missing quotes ("") around 'SA_Yes'?
1>C:\Program Files\Microsoft Visual Studio 9.0\VC\include\ctype.h(95) : error C2065: 'SA_Read' : undeclared identifier
1> missing quotes ("") around 'SA_Read'?
1>C:\Program Files\Microsoft Visual Studio 9.0\VC\include\ctype.h(95) : error C2337: 'SA_Pre' : attribute not found
1>C:\Program Files\Microsoft Visual Studio 9.0\VC\include\ctype.h(95) : error C2065: 'SA_Maybe' : undeclared identifier
1> missing quotes ("") around 'SA_Maybe'?
1>C:\Program Files\Microsoft Visual Studio 9.0\VC\include\ctype.h(95) : error C2337: 'SA_Pre' : attribute not found
1>C:\Program Files\Microsoft Visual Studio 9.0\VC\include\ctype.h(95) : error C2065: 'SA_Yes' : undeclared identifier
1> missing quotes ("") around 'SA_Yes'?
1>C:\Program Files\Microsoft Visual Studio 9.0\VC\include\ctype.h(95) : error C2337: 'SA_Pre' : attribute not found
1>C:\Program Files\Microsoft Visual Studio 9.0\VC\include\ctype.h(95) : error C2065: 'SA_Read' : undeclared identifier
1> missing quotes ("") around 'SA_Read'?
1>C:\Program Files\Microsoft Visual Studio 9.0\VC\include\ctype.h(96) : error C2337: 'SA_Post' : attribute not found
1>C:\Program Files\Microsoft Visual Studio 9.0\VC\include\ctype.h(96) : error C2065: 'SA_Yes' : undeclared identifier
1> missing quotes ("") around 'SA_Yes'?
1>C:\Program Files\Microsoft Visual Studio 9.0\VC\include\ctype.h(96) : error C2337: 'SA_Pre' : attribute not found
1>C:\Program Files\Microsoft Visual Studio 9.0\VC\include\ctype.h(96) : error C2065: 'SA_No' : undeclared identifier
1> missing quotes ("") around 'SA_No'?
1>C:\Program Files\Microsoft Visual Studio 9.0\VC\include\ctype.h(96) : error C2337: 'SA_Pre' : attribute not found
1>C:\Program Files\Microsoft Visual Studio 9.0\VC\include\ctype.h(96) : error C2065: 'SA_Yes' : undeclared identifier
1> missing quotes ("") around 'SA_Yes'?
1>C:\Program Files\Microsoft Visual Studio 9.0\VC\include\ctype.h(96) : error C2065: 'SA_Read' : undeclared identifier
1> missing quotes ("") around 'SA_Read'?
1>C:\Program Files\Microsoft Visual Studio 9.0\VC\include\ctype.h(97) : error C2337: 'SA_Post' : attribute not found
1>C:\Program Files\Microsoft Visual Studio 9.0\VC\include\ctype.h(97) : error C2065: 'SA_Yes' : undeclared identifier
1> missing quotes ("") around 'SA_Yes'?
1>C:\Program Files\Microsoft Visual Studio 9.0\VC\include\ctype.h(97) : error C2337: 'SA_Pre' : attribute not found
1>C:\Program Files\Microsoft Visual Studio 9.0\VC\include\ctype.h(97) : error C2065: 'SA_No' : undeclared identifier
1> missing quotes ("") around 'SA_No'?
1>C:\Program Files\Microsoft Visual Studio 9.0\VC\include\ctype.h(97) : error C2337: 'SA_Pre' : attribute not found
1>C:\Program Files\Microsoft Visual Studio 9.0\VC\include\ctype.h(97) : error C2065: 'SA_Yes' : undeclared identifier
1> missing quotes ("") around 'SA_Yes'?
1>C:\Program Files\Microsoft Visual Studio 9.0\VC\include\ctype.h(97) : error C2065: 'SA_Read' : undeclared identifier
1> missing quotes ("") around 'SA_Read'?
1>C:\Program Files\Microsoft Visual Studio 9.0\VC\include\ctype.h(97) : error C2337: 'SA_Pre' : attribute not found
1>C:\Program Files\Microsoft Visual Studio 9.0\VC\include\ctype.h(97) : error C2065: 'SA_Maybe' : undeclared identifier
1> missing quotes ("") around 'SA_Maybe'?
1>C:\Program Files\Microsoft Visual Studio 9.0\VC\include\ctype.h(97) : error C2337: 'SA_Pre' : attribute not found
1>C:\Program Files\Microsoft Visual Studio 9.0\VC\include\ctype.h(97) : error C2065: 'SA_Yes' : undeclared identifier
1> missing quotes ("") around 'SA_Yes'?
1>C:\Program Files\Microsoft Visual Studio 9.0\VC\include\ctype.h(97) : error C2337: 'SA_Pre' : attribute not found
1>C:\Program Files\Microsoft Visual Studio 9.0\VC\include\ctype.h(97) : error C2065: 'SA_Read' : undeclared identifier
1> missing quotes ("") around 'SA_Read'?
1>C:\Program Files\Microsoft Visual Studio 9.0\VC\include\ctype.h(98) : error C2337: 'SA_Post' : attribute not found
1>C:\Program Files\Microsoft Visual Studio 9.0\VC\include\ctype.h(98) : error C2065: 'SA_Yes' : undeclared identifier
1> missing quotes ("") around 'SA_Yes'?
1>C:\Program Files\Microsoft Visual Studio 9.0\VC\include\ctype.h(98) : error C2337: 'SA_Pre' : attribute not found
1>C:\Program Files\Microsoft Visual Studio 9.0\VC\include\ctype.h(98) : error C2065: 'SA_No' : undeclared identifier
1> missing quotes ("") around 'SA_No'?
1>C:\Program Files\Microsoft Visual Studio 9.0\VC\include\ctype.h(98) : error C2337: 'SA_Pre' : attribute not found
1>C:\Program Files\Microsoft Visual Studio 9.0\VC\include\ctype.h(98) : error C2065: 'SA_Yes' : undeclared identifier
1> missing quotes ("") around 'SA_Yes'?
1>C:\Program Files\Microsoft Visual Studio 9.0\VC\include\ctype.h(98) : error C2065: 'SA_Read' : undeclared identifier
1> missing quotes ("") around 'SA_Read'?
1>C:\Program Files\Microsoft Visual Studio 9.0\VC\include\ctype.h(99) : error C2337: 'SA_Post' : attribute not found
1>C:\Program Files\Microsoft Visual Studio 9.0\VC\include\ctype.h(99) : error C2065: 'SA_Yes' : undeclared identifier
1> missing quotes ("") around 'SA_Yes'?
1>C:\Program Files\Microsoft Visual Studio 9.0\VC\include\ctype.h(99) : error C2337: 'SA_Pre' : attribute not found
1>C:\Program Files\Microsoft Visual Studio 9.0\VC\include\ctype.h(99) : error C2065: 'SA_No' : undeclared identifier
1> missing quotes ("") around 'SA_No'?
1>C:\Program Files\Microsoft Visual Studio 9.0\VC\include\ctype.h(99) : error C2337: 'SA_Pre' : attribute not found
1>C:\Program Files\Microsoft Visual Studio 9.0\VC\include\ctype.h(99) : error C2065: 'SA_Yes' : undeclared identifier
1> missing quotes ("") around 'SA_Yes'?
1>C:\Program Files\Microsoft Visual Studio 9.0\VC\include\ctype.h(99) : error C2065: 'SA_Read' : undeclared identifier
1> missing quotes ("") around 'SA_Read'?
1>C:\Program Files\Microsoft Visual Studio 9.0\VC\include\ctype.h(99) : error C2337: 'SA_Pre' : attribute not found
1>C:\Program Files\Microsoft Visual Studio 9.0\VC\include\ctype.h(99) : error C2065: 'SA_Maybe' : undeclared identifier
1> missing quotes ("") around 'SA_Maybe'?
1>C:\Program Files\Microsoft Visual Studio 9.0\VC\include\ctype.h(99) : error C2337: 'SA_Pre' : attribute not found
1>C:\Program Files\Microsoft Visual Studio 9.0\VC\include\ctype.h(99) : error C2065: 'SA_Yes' : undeclared identifier
1> missing quotes ("") around 'SA_Yes'?
1>C:\Program Files\Microsoft Visual Studio 9.0\VC\include\ctype.h(99) : error C2337: 'SA_Pre' : attribute not found
1>C:\Program Files\Microsoft Visual Studio 9.0\VC\include\ctype.h(99) : error C2065: 'SA_Read' : undeclared identifier
1> missing quotes ("") around 'SA_Read'?
1>C:\Program Files\Microsoft Visual Studio 9.0\VC\include\ctype.h(100) : error C2337: 'SA_Post' : attribute not found
1>C:\Program Files\Microsoft Visual Studio 9.0\VC\include\ctype.h(100) : error C2065: 'SA_Yes' : undeclared identifier
1> missing quotes ("") around 'SA_Yes'?
1>C:\Program Files\Microsoft Visual Studio 9.0\VC\include\ctype.h(100) : error C2337: 'SA_Pre' : attribute not found
1>C:\Program Files\Microsoft Visual Studio 9.0\VC\include\ctype.h(100) : error C2065: 'SA_No' : undeclared identifier
1> missing quotes ("") around 'SA_No'?
1>C:\Program Files\Microsoft Visual Studio 9.0\VC\include\ctype.h(100) : error C2337: 'SA_Pre' : attribute not found
1>C:\Program Files\Microsoft Visual Studio 9.0\VC\include\ctype.h(100) : error C2065: 'SA_Yes' : undeclared identifier
1> missing quotes ("") around 'SA_Yes'?
1>C:\Program Files\Microsoft Visual Studio 9.0\VC\include\ctype.h(100) : error C2065: 'SA_Read' : undeclared identifier
1> missing quotes ("") around 'SA_Read'?
1>C:\Program Files\Microsoft Visual Studio 9.0\VC\include\ctype.h(101) : error C2337: 'SA_Post' : attribute not found
1>C:\Program Files\Microsoft Visual Studio 9.0\VC\include\ctype.h(101) : error C2065: 'SA_Yes' : undeclared identifier
1>C:\Program Files\Microsoft Visual Studio 9.0\VC\include\ctype.h(101) : fatal error C1003: error count exceeds 100; stopping compilation
1>Base.cpp
1>C:\Program Files\Microsoft Visual Studio 9.0\VC\include\excpt.h(60) : error C2337: 'SA_Pre' : attribute not found
1>C:\Program Files\Microsoft Visual Studio 9.0\VC\include\excpt.h(60) : error C2065: 'SA_No' : undeclared identifier
1> missing quotes ("") around 'SA_No'?
1>C:\Program Files\Microsoft Visual Studio 9.0\VC\include\excpt.h(60) : error C2337: 'SA_Pre' : attribute not found
1>C:\Program Files\Microsoft Visual Studio 9.0\VC\include\excpt.h(60) : error C2065: 'SA_Yes' : undeclared identifier
1> missing quotes ("") around 'SA_Yes'?
1>C:\Program Files\Microsoft Visual Studio 9.0\VC\include\excpt.h(60) : error C2065: 'SA_Read' : undeclared identifier
1> missing quotes ("") around 'SA_Read'?
1>C:\Program Files\Microsoft Visual Studio 9.0\VC\include\excpt.h(61) : error C2337: 'SA_Pre' : attribute not found
1>C:\Program Files\Microsoft Visual Studio 9.0\VC\include\excpt.h(61) : error C2065: 'SA_No' : undeclared identifier
1> missing quotes ("") around 'SA_No'?
1>C:\Program Files\Microsoft Visual Studio 9.0\VC\include\excpt.h(61) : error C2337: 'SA_Pre' : attribute not found
1>C:\Program Files\Microsoft Visual Studio 9.0\VC\include\excpt.h(61) : error C2065: 'SA_Yes' : undeclared identifier
1> missing quotes ("") around 'SA_Yes'?
1>C:\Program Files\Microsoft Visual Studio 9.0\VC\include\excpt.h(61) : error C2065: 'SA_Read' : undeclared identifier
1> missing quotes ("") around 'SA_Read'?
1>C:\Program Files\Microsoft Visual Studio 9.0\VC\include\excpt.h(62) : error C2337: 'SA_Pre' : attribute not found
1>C:\Program Files\Microsoft Visual Studio 9.0\VC\include\excpt.h(62) : error C2065: 'SA_No' : undeclared identifier
1> missing quotes ("") around 'SA_No'?
1>C:\Program Files\Microsoft Visual Studio 9.0\VC\include\excpt.h(62) : error C2337: 'SA_Pre' : attribute not found
1>C:\Program Files\Microsoft Visual Studio 9.0\VC\include\excpt.h(62) : error C2065: 'SA_Yes' : undeclared identifier
1> missing quotes ("") around 'SA_Yes'?
1>C:\Program Files\Microsoft Visual Studio 9.0\VC\include\excpt.h(62) : error C2337: 'SA_Post' : attribute not found
1>C:\Program Files\Microsoft Visual Studio 9.0\VC\include\excpt.h(62) : error C2065: 'SA_Yes' : undeclared identifier
1> missing quotes ("") around 'SA_Yes'?
1>C:\Program Files\Microsoft Visual Studio 9.0\VC\include\excpt.h(63) : error C2337: 'SA_Pre' : attribute not found
1>C:\Program Files\Microsoft Visual Studio 9.0\VC\include\excpt.h(63) : error C2065: 'SA_No' : undeclared identifier
1> missing quotes ("") around 'SA_No'?
1>C:\Program Files\Microsoft Visual Studio 9.0\VC\include\excpt.h(63) : error C2337: 'SA_Pre' : attribute not found
1>C:\Program Files\Microsoft Visual Studio 9.0\VC\include\excpt.h(63) : error C2065: 'SA_Yes' : undeclared identifier
1> missing quotes ("") around 'SA_Yes'?
1>C:\Program Files\Microsoft Visual Studio 9.0\VC\include\excpt.h(63) : error C2337: 'SA_Post' : attribute not found
1>C:\Program Files\Microsoft Visual Studio 9.0\VC\include\excpt.h(63) : error C2065: 'SA_Yes' : undeclared identifier
1> missing quotes ("") around 'SA_Yes'?
1>C:\Program Files\Microsoft Visual Studio 9.0\VC\include\ctype.h(94) : error C2337: 'SA_Post' : attribute not found
1>C:\Program Files\Microsoft Visual Studio 9.0\VC\include\ctype.h(94) : error C2065: 'SA_Yes' : undeclared identifier
1> missing quotes ("") around 'SA_Yes'?
1>C:\Program Files\Microsoft Visual Studio 9.0\VC\include\ctype.h(94) : error C2337: 'SA_Pre' : attribute not found
1>C:\Program Files\Microsoft Visual Studio 9.0\VC\include\ctype.h(94) : error C2065: 'SA_No' : undeclared identifier
1> missing quotes ("") around 'SA_No'?
1>C:\Program Files\Microsoft Visual Studio 9.0\VC\include\ctype.h(94) : error C2337: 'SA_Pre' : attribute not found
1>C:\Program Files\Microsoft Visual Studio 9.0\VC\include\ctype.h(94) : error C2065: 'SA_Yes' : undeclared identifier
1> missing quotes ("") around 'SA_Yes'?
1>C:\Program Files\Microsoft Visual Studio 9.0\VC\include\ctype.h(94) : error C2065: 'SA_Read' : undeclared identifier
1> missing quotes ("") around 'SA_Read'?
1>C:\Program Files\Microsoft Visual Studio 9.0\VC\include\ctype.h(94) : error C2337: 'SA_Pre' : attribute not found
1>C:\Program Files\Microsoft Visual Studio 9.0\VC\include\ctype.h(94) : error C2065: 'SA_No' : undeclared identifier
1> missing quotes ("") around 'SA_No'?
1>C:\Program Files\Microsoft Visual Studio 9.0\VC\include\ctype.h(94) : error C2337: 'SA_Pre' : attribute not found
1>C:\Program Files\Microsoft Visual Studio 9.0\VC\include\ctype.h(94) : error C2065: 'SA_Yes' : undeclared identifier
1> missing quotes ("") around 'SA_Yes'?
1>C:\Program Files\Microsoft Visual Studio 9.0\VC\include\ctype.h(94) : error C2065: 'SA_Read' : undeclared identifier
1> missing quotes ("") around 'SA_Read'?
1>C:\Program Files\Microsoft Visual Studio 9.0\VC\include\ctype.h(95) : error C2337: 'SA_Post' : attribute not found
1>C:\Program Files\Microsoft Visual Studio 9.0\VC\include\ctype.h(95) : error C2065: 'SA_Yes' : undeclared identifier
1> missing quotes ("") around 'SA_Yes'?
1>C:\Program Files\Microsoft Visual Studio 9.0\VC\include\ctype.h(95) : error C2337: 'SA_Pre' : attribute not found
1>C:\Program Files\Microsoft Visual Studio 9.0\VC\include\ctype.h(95) : error C2065: 'SA_No' : undeclared identifier
1> missing quotes ("") around 'SA_No'?
1>C:\Program Files\Microsoft Visual Studio 9.0\VC\include\ctype.h(95) : error C2337: 'SA_Pre' : attribute not found
1>C:\Program Files\Microsoft Visual Studio 9.0\VC\include\ctype.h(95) : error C2065: 'SA_Yes' : undeclared identifier
1> missing quotes ("") around 'SA_Yes'?
1>C:\Program Files\Microsoft Visual Studio 9.0\VC\include\ctype.h(95) : error C2065: 'SA_Read' : undeclared identifier
1> missing quotes ("") around 'SA_Read'?
1>C:\Program Files\Microsoft Visual Studio 9.0\VC\include\ctype.h(95) : error C2337: 'SA_Pre' : attribute not found
1>C:\Program Files\Microsoft Visual Studio 9.0\VC\include\ctype.h(95) : error C2065: 'SA_No' : undeclared identifier
1> missing quotes ("") around 'SA_No'?
1>C:\Program Files\Microsoft Visual Studio 9.0\VC\include\ctype.h(95) : error C2337: 'SA_Pre' : attribute not found
1>C:\Program Files\Microsoft Visual Studio 9.0\VC\include\ctype.h(95) : error C2065: 'SA_Yes' : undeclared identifier
1> missing quotes ("") around 'SA_Yes'?
1>C:\Program Files\Microsoft Visual Studio 9.0\VC\include\ctype.h(95) : error C2065: 'SA_Read' : undeclared identifier
1> missing quotes ("") around 'SA_Read'?
1>C:\Program Files\Microsoft Visual Studio 9.0\VC\include\ctype.h(95) : error C2337: 'SA_Pre' : attribute not found
1>C:\Program Files\Microsoft Visual Studio 9.0\VC\include\ctype.h(95) : error C2065: 'SA_Maybe' : undeclared identifier
1> missing quotes ("") around 'SA_Maybe'?
1>C:\Program Files\Microsoft Visual Studio 9.0\VC\include\ctype.h(95) : error C2337: 'SA_Pre' : attribute not found
1>C:\Program Files\Microsoft Visual Studio 9.0\VC\include\ctype.h(95) : error C2065: 'SA_Yes' : undeclared identifier
1> missing quotes ("") around 'SA_Yes'?
1>C:\Program Files\Microsoft Visual Studio 9.0\VC\include\ctype.h(95) : error C2337: 'SA_Pre' : attribute not found
1>C:\Program Files\Microsoft Visual Studio 9.0\VC\include\ctype.h(95) : error C2065: 'SA_Read' : undeclared identifier
1> missing quotes ("") around 'SA_Read'?
1>C:\Program Files\Microsoft Visual Studio 9.0\VC\include\ctype.h(96) : error C2337: 'SA_Post' : attribute not found
1>C:\Program Files\Microsoft Visual Studio 9.0\VC\include\ctype.h(96) : error C2065: 'SA_Yes' : undeclared identifier
1> missing quotes ("") around 'SA_Yes'?
1>C:\Program Files\Microsoft Visual Studio 9.0\VC\include\ctype.h(96) : error C2337: 'SA_Pre' : attribute not found
1>C:\Program Files\Microsoft Visual Studio 9.0\VC\include\ctype.h(96) : error C2065: 'SA_No' : undeclared identifier
1> missing quotes ("") around 'SA_No'?
1>C:\Program Files\Microsoft Visual Studio 9.0\VC\include\ctype.h(96) : error C2337: 'SA_Pre' : attribute not found
1>C:\Program Files\Microsoft Visual Studio 9.0\VC\include\ctype.h(96) : error C2065: 'SA_Yes' : undeclared identifier
1> missing quotes ("") around 'SA_Yes'?
1>C:\Program Files\Microsoft Visual Studio 9.0\VC\include\ctype.h(96) : error C2065: 'SA_Read' : undeclared identifier
1> missing quotes ("") around 'SA_Read'?
1>C:\Program Files\Microsoft Visual Studio 9.0\VC\include\ctype.h(97) : error C2337: 'SA_Post' : attribute not found
1>C:\Program Files\Microsoft Visual Studio 9.0\VC\include\ctype.h(97) : error C2065: 'SA_Yes' : undeclared identifier
1> missing quotes ("") around 'SA_Yes'?
1>C:\Program Files\Microsoft Visual Studio 9.0\VC\include\ctype.h(97) : error C2337: 'SA_Pre' : attribute not found
1>C:\Program Files\Microsoft Visual Studio 9.0\VC\include\ctype.h(97) : error C2065: 'SA_No' : undeclared identifier
1> missing quotes ("") around 'SA_No'?
1>C:\Program Files\Microsoft Visual Studio 9.0\VC\include\ctype.h(97) : error C2337: 'SA_Pre' : attribute not found
1>C:\Program Files\Microsoft Visual Studio 9.0\VC\include\ctype.h(97) : error C2065: 'SA_Yes' : undeclared identifier
1> missing quotes ("") around 'SA_Yes'?
1>C:\Program Files\Microsoft Visual Studio 9.0\VC\include\ctype.h(97) : error C2065: 'SA_Read' : undeclared identifier
1> missing quotes ("") around 'SA_Read'?
1>C:\Program Files\Microsoft Visual Studio 9.0\VC\include\ctype.h(97) : error C2337: 'SA_Pre' : attribute not found
1>C:\Program Files\Microsoft Visual Studio 9.0\VC\include\ctype.h(97) : error C2065: 'SA_Maybe' : undeclared identifier
1> missing quotes ("") around 'SA_Maybe'?
1>C:\Program Files\Microsoft Visual Studio 9.0\VC\include\ctype.h(97) : error C2337: 'SA_Pre' : attribute not found
1>C:\Program Files\Microsoft Visual Studio 9.0\VC\include\ctype.h(97) : error C2065: 'SA_Yes' : undeclared identifier
1> missing quotes ("") around 'SA_Yes'?
1>C:\Program Files\Microsoft Visual Studio 9.0\VC\include\ctype.h(97) : error C2337: 'SA_Pre' : attribute not found
1>C:\Program Files\Microsoft Visual Studio 9.0\VC\include\ctype.h(97) : error C2065: 'SA_Read' : undeclared identifier
1> missing quotes ("") around 'SA_Read'?
1>C:\Program Files\Microsoft Visual Studio 9.0\VC\include\ctype.h(98) : error C2337: 'SA_Post' : attribute not found
1>C:\Program Files\Microsoft Visual Studio 9.0\VC\include\ctype.h(98) : error C2065: 'SA_Yes' : undeclared identifier
1> missing quotes ("") around 'SA_Yes'?
1>C:\Program Files\Microsoft Visual Studio 9.0\VC\include\ctype.h(98) : error C2337: 'SA_Pre' : attribute not found
1>C:\Program Files\Microsoft Visual Studio 9.0\VC\include\ctype.h(98) : error C2065: 'SA_No' : undeclared identifier
1> missing quotes ("") around 'SA_No'?
1>C:\Program Files\Microsoft Visual Studio 9.0\VC\include\ctype.h(98) : error C2337: 'SA_Pre' : attribute not found
1>C:\Program Files\Microsoft Visual Studio 9.0\VC\include\ctype.h(98) : error C2065: 'SA_Yes' : undeclared identifier
1> missing quotes ("") around 'SA_Yes'?
1>C:\Program Files\Microsoft Visual Studio 9.0\VC\include\ctype.h(98) : error C2065: 'SA_Read' : undeclared identifier
1> missing quotes ("") around 'SA_Read'?
1>C:\Program Files\Microsoft Visual Studio 9.0\VC\include\ctype.h(99) : error C2337: 'SA_Post' : attribute not found
1>C:\Program Files\Microsoft Visual Studio 9.0\VC\include\ctype.h(99) : error C2065: 'SA_Yes' : undeclared identifier
1> missing quotes ("") around 'SA_Yes'?
1>C:\Program Files\Microsoft Visual Studio 9.0\VC\include\ctype.h(99) : error C2337: 'SA_Pre' : attribute not found
1>C:\Program Files\Microsoft Visual Studio 9.0\VC\include\ctype.h(99) : error C2065: 'SA_No' : undeclared identifier
1> missing quotes ("") around 'SA_No'?
1>C:\Program Files\Microsoft Visual Studio 9.0\VC\include\ctype.h(99) : error C2337: 'SA_Pre' : attribute not found
1>C:\Program Files\Microsoft Visual Studio 9.0\VC\include\ctype.h(99) : error C2065: 'SA_Yes' : undeclared identifier
1> missing quotes ("") around 'SA_Yes'?
1>C:\Program Files\Microsoft Visual Studio 9.0\VC\include\ctype.h(99) : error C2065: 'SA_Read' : undeclared identifier
1> missing quotes ("") around 'SA_Read'?
1>C:\Program Files\Microsoft Visual Studio 9.0\VC\include\ctype.h(99) : error C2337: 'SA_Pre' : attribute not found
1>C:\Program Files\Microsoft Visual Studio 9.0\VC\include\ctype.h(99) : error C2065: 'SA_Maybe' : undeclared identifier
1> missing quotes ("") around 'SA_Maybe'?
1>C:\Program Files\Microsoft Visual Studio 9.0\VC\include\ctype.h(99) : error C2337: 'SA_Pre' : attribute not found
1>C:\Program Files\Microsoft Visual Studio 9.0\VC\include\ctype.h(99) : error C2065: 'SA_Yes' : undeclared identifier
1> missing quotes ("") around 'SA_Yes'?
1>C:\Program Files\Microsoft Visual Studio 9.0\VC\include\ctype.h(99) : error C2337: 'SA_Pre' : attribute not found
1>C:\Program Files\Microsoft Visual Studio 9.0\VC\include\ctype.h(99) : error C2065: 'SA_Read' : undeclared identifier
1> missing quotes ("") around 'SA_Read'?
1>C:\Program Files\Microsoft Visual Studio 9.0\VC\include\ctype.h(100) : error C2337: 'SA_Post' : attribute not found
1>C:\Program Files\Microsoft Visual Studio 9.0\VC\include\ctype.h(100) : error C2065: 'SA_Yes' : undeclared identifier
1> missing quotes ("") around 'SA_Yes'?
1>C:\Program Files\Microsoft Visual Studio 9.0\VC\include\ctype.h(100) : error C2337: 'SA_Pre' : attribute not found
1>C:\Program Files\Microsoft Visual Studio 9.0\VC\include\ctype.h(100) : error C2065: 'SA_No' : undeclared identifier
1> missing quotes ("") around 'SA_No'?
1>C:\Program Files\Microsoft Visual Studio 9.0\VC\include\ctype.h(100) : error C2337: 'SA_Pre' : attribute not found
1>C:\Program Files\Microsoft Visual Studio 9.0\VC\include\ctype.h(100) : error C2065: 'SA_Yes' : undeclared identifier
1> missing quotes ("") around 'SA_Yes'?
1>C:\Program Files\Microsoft Visual Studio 9.0\VC\include\ctype.h(100) : error C2065: 'SA_Read' : undeclared identifier
1> missing quotes ("") around 'SA_Read'?
1>C:\Program Files\Microsoft Visual Studio 9.0\VC\include\ctype.h(101) : error C2337: 'SA_Post' : attribute not found
1>C:\Program Files\Microsoft Visual Studio 9.0\VC\include\ctype.h(101) : error C2065: 'SA_Yes' : undeclared identifier
1>C:\Program Files\Microsoft Visual Studio 9.0\VC\include\ctype.h(101) : fatal error C1003: error count exceeds 100; stopping compilation
1>Build log was saved at "file://d:\Meus documentos\Programação Combat Arms\CABASE\H3R0 1.0\CABASE\Release\BuildLog.htm"
1>CABASE - 408 error(s), 0 warning(s)
========== Rebuild All: 0 succeeded, 1 failed, 0 skipped ==========
