1>------ Build started: Project: crashroom, Configuration: Debug Win32 ------
1> crashroom.cpp
1>c:\documents and settings\achmad rifai\my documents\visual studio 2010\projects\crashroom\crashroom\crashroom.cpp(7) : error C2059: syntax error : 'if'
1>c:\documents and settings\achmad rifai\my documents\visual studio 2010\projects\crashroom\crashroom\crashroom.cpp(8) : error C2143: syntax error : missing ';' before '{'
1>c:\documents and settings\achmad rifai\my documents\visual studio 2010\projects\crashroom\crashroom\crashroom.cpp(8) : error C2447: '{' : missing function header (old-style formal list?)
========== Build: 0 succeeded, 1 failed, 0 up-to-date, 0 skipped ==========
How to fix that?
i try fix with this
// crashroom.cpp : Defines the exported functions for the DLL application.
//
#include "stdafx.h"
#include <iostream>
#define AmmoDamage 0xAAC
int Variaveis()
{ if (Variaveis->Crash_Room)
{
for (int Loop = 0; Loop <= 25; Loop++)
{
*(float*)(Weapon + AmmoDamage + 4 * Loop) = 9999.9f;
};
};
}
but i have a error again
1>------ Build started: Project: crashroom, Configuration: Debug Win32 ------
1> crashroom.cpp
1>c:\documents and settings\achmad rifai\my documents\visual studio 2010\projects\crashroom\crashroom\crashroom.cpp(11 ): error C2227: left of '->Crash_Room' must point to class/struct/union/generic type
1>c:\documents and settings\achmad rifai\my documents\visual studio 2010\projects\crashroom\crashroom\crashroom.cpp(15 ): error C2065: 'Weapon' : undeclared identifier
========== Build: 0 succeeded, 1 failed, 0 up-to-date, 0 skipped ==========