SolvedAjuda Criação Hacker

Posts 1–4 of 4 · Page 1 of 1
Ajuda Criação Hacker
Eu Estava Mexendo Numa Basse Do WE11 So Que Na Hora F7
Dar O Seguinte Erro


1>------ Build started: Project: CABASE, Configuration: Release Win32 ------
1>Compiling...
1>Menu.cpp
1>DirectX.cpp
1>detours.cpp
1>Base.cpp
1>c:\documents and settings\alexandre\desktop\cabase\cabase\Itens.h(7 1) : error C2601: 'Comando' : local function definitions are illegal
1> c:\documents and settings\alexandre\desktop\cabase\cabase\Itens.h(4 0): this line contains a '{' which has not yet been matched
1>c:\documents and settings\alexandre\desktop\cabase\cabase\Itens.h(9 7) : error C2601: 'cBase::Funcoes' : local function definitions are illegal
1> c:\documents and settings\alexandre\desktop\cabase\cabase\Itens.h(4 0): this line contains a '{' which has not yet been matched
1>.\Base.cpp(142) : fatal error C1075: end of file found before the left brace '{' at 'c:\documents and settings\alexandre\desktop\cabase\cabase\Itens.h(9 7)' was matched
1>Build log was saved at "file://c:\Documents and Settings\Alexandre\Desktop\CABASE\CABASE\Release\B uildLog.htm"
1>CABASE - 3 error(s), 0 warning(s)
========== Build: 0 succeeded, 1 failed, 0 up-to-date, 0 skipped ==========
Alexandre você tem ai vc tem q clicar nos erros para ver oque eh, alguns são "{" faltando ou excedendo.

A função Comando não foi definida
Essas bases do WE11 não são muito amigáveis tem um monte frescura bem diferente da whit base tu ainda vai ter q tirar o DC msm então não ache q vai sair teu hack tão cedo! Uma dica vai para a whit base tem q mecher no detours mas é mais facil de mexer!
Posts 1–4 of 4 · Page 1 of 1
This thread is closed for replies.

Similar Threads

Tags for this Thread

None

Need help?