D3d HaCk (NoT fUlLy FiNiShEd)

Posts 16–30 of 47 · Page 2 of 4
Quote Originally Posted by Assassin's Creed View Post


well Menu is easy...but hook is hard


on topic:
Wow thats a very big menu lol
this is little MINE OVERFLOW the screen ! bcs i dont know how to make it with pages and the when the tabs are opend SUX
anyway i like your style
Quote Originally Posted by kmanev073 View Post
this is little MINE OVERFLOW the screen ! bcs i dont know how to make it with pages and the when the tabs are opend SUX
anyway i like your style
dude just start with an easy menu....tabs,pages and check boxes are hard if u are going to make ur first new menu
ok, answer my question !!!
is the midhook and yourmenu.dll are in 1 dll or seperated?????????

they both gonna inject?????
Quote Originally Posted by pakeke80 View Post
ok, answer my question !!!
is the midhook and yourmenu.dll are in 1 dll or seperated?????????
U dont know what u are talking about. The hook and the menu are always in the same dll.
i have made my menu but hook is a crap
Quote Originally Posted by maximus8011 View Post
If you saying it's not hard to make hook,make a tut how to make a hook if you say it's not hard.;-)
no becouse you should learn coding first and then you can do it without looking into a tut (maybe) .. and if not, you can use google > then google for a tut.. > there are much!
ABCDEFG, HOOK!!!
The reason why it got detected the whole time is because of your Detours. You need to check them after each CF Update, and if its detected update detours, features everything. And then it should work.
biggers error ever :
Code:
1>------ Build started: Project: A5EERAN, Configuration: Release Win32 ------
1>Compiling...
1>lol.cpp
1>.\lol.cpp(96) : warning C4409: illegal instruction size
1>idiot.cpp
1>.\idiot.cpp(50) : warning C4996: 'strncpy': This function or variable may be unsafe. Consider using strncpy_s instead. To disable deprecation, use _CRT_SECURE_NO_WARNINGS. See online help for details.
1>        H:\Program Files\Microsoft Visual Studio 9.0\VC\include\string.h(157) : see declaration of 'strncpy'
1>fuck.cpp
1>d3dfont9.cpp
1>h:\documents and settings\user\desktop\a5eeran\a5eeran\D3DFont9.h(33) : error C2146: syntax error : missing ';' before identifier 'm_dwFontHeight'
1>h:\documents and settings\user\desktop\a5eeran\a5eeran\D3DFont9.h(33) : error C4430: missing type specifier - int assumed. Note: C++ does not support default-int
1>h:\documents and settings\user\desktop\a5eeran\a5eeran\D3DFont9.h(33) : error C4430: missing type specifier - int assumed. Note: C++ does not support default-int
1>h:\documents and settings\user\desktop\a5eeran\a5eeran\D3DFont9.h(34) : error C2146: syntax error : missing ';' before identifier 'm_dwFontFlags'
1>h:\documents and settings\user\desktop\a5eeran\a5eeran\D3DFont9.h(34) : error C4430: missing type specifier - int assumed. Note: C++ does not support default-int
1>h:\documents and settings\user\desktop\a5eeran\a5eeran\D3DFont9.h(34) : error C4430: missing type specifier - int assumed. Note: C++ does not support default-int
1>h:\documents and settings\user\desktop\a5eeran\a5eeran\D3DFont9.h(39) : error C2146: syntax error : missing ';' before identifier 'm_dwTexWidth'
1>h:\documents and settings\user\desktop\a5eeran\a5eeran\D3DFont9.h(39) : error C4430: missing type specifier - int assumed. Note: C++ does not support default-int
1>h:\documents and settings\user\desktop\a5eeran\a5eeran\D3DFont9.h(39) : error C4430: missing type specifier - int assumed. Note: C++ does not support default-int
1>h:\documents and settings\user\desktop\a5eeran\a5eeran\D3DFont9.h(40) : error C2146: syntax error : missing ';' before identifier 'm_dwTexHeight'
1>h:\documents and settings\user\desktop\a5eeran\a5eeran\D3DFont9.h(40) : error C4430: missing type specifier - int assumed. Note: C++ does not support default-int
1>h:\documents and settings\user\desktop\a5eeran\a5eeran\D3DFont9.h(40) : error C4430: missing type specifier - int assumed. Note: C++ does not support default-int
1>h:\documents and settings\user\desktop\a5eeran\a5eeran\D3DFont9.h(43) : error C2146: syntax error : missing ';' before identifier 'm_dwSpacing'
1>h:\documents and settings\user\desktop\a5eeran\a5eeran\D3DFont9.h(43) : error C4430: missing type specifier - int assumed. Note: C++ does not support default-int
1>h:\documents and settings\user\desktop\a5eeran\a5eeran\D3DFont9.h(43) : error C4430: missing type specifier - int assumed. Note: C++ does not support default-int
1>h:\documents and settings\user\desktop\a5eeran\a5eeran\D3DFont9.h(51) : error C2061: syntax error : identifier 'DWRD'
1>h:\documents and settings\user\desktop\a5eeran\a5eeran\D3DFont9.h(54) : error C2061: syntax error : identifier 'DWRD'
1>h:\documents and settings\user\desktop\a5eeran\a5eeran\D3DFont9.h(56) : error C2061: syntax error : identifier 'DWRD'
1>h:\documents and settings\user\desktop\a5eeran\a5eeran\D3DFont9.h(68) : error C2061: syntax error : identifier 'DWRD'
1>.\d3dfont9.cpp(21) : error C2146: syntax error : missing ';' before identifier 'color'
1>.\d3dfont9.cpp(21) : error C4430: missing type specifier - int assumed. Note: C++ does not support default-int
1>.\d3dfont9.cpp(21) : error C4430: missing type specifier - int assumed. Note: C++ does not support default-int
1>.\d3dfont9.cpp(30) : error C2039: 'color' : is not a member of 'FONT2DVERTEX'
1>        .\d3dfont9.cpp(21) : see declaration of 'FONT2DVERTEX'
1>.\d3dfont9.cpp(48) : error C2061: syntax error : identifier 'DWRD'
1>.\d3dfont9.cpp(52) : error C2065: 'm_dwFontHeight' : undeclared identifier
1>.\d3dfont9.cpp(52) : error C2065: 'dwHeight' : undeclared identifier
1>.\d3dfont9.cpp(53) : error C2065: 'm_dwFontFlags' : undeclared identifier
1>.\d3dfont9.cpp(53) : error C2065: 'dwFlags' : undeclared identifier
1>.\d3dfont9.cpp(54) : error C2065: 'm_dwSpacing' : undeclared identifier
1>.\d3dfont9.cpp(96) : error C2065: 'm_dwFontHeight' : undeclared identifier
1>.\d3dfont9.cpp(97) : error C2065: 'm_dwTexWidth' : undeclared identifier
1>.\d3dfont9.cpp(97) : error C2065: 'm_dwTexHeight' : undeclared identifier
1>.\d3dfont9.cpp(98) : error C2065: 'm_dwFontHeight' : undeclared identifier
1>.\d3dfont9.cpp(99) : error C2065: 'm_dwTexWidth' : undeclared identifier
1>.\d3dfont9.cpp(99) : error C2065: 'm_dwTexHeight' : undeclared identifier
1>.\d3dfont9.cpp(100) : error C2065: 'm_dwFontHeight' : undeclared identifier
1>.\d3dfont9.cpp(101) : error C2065: 'm_dwTexWidth' : undeclared identifier
1>.\d3dfont9.cpp(101) : error C2065: 'm_dwTexHeight' : undeclared identifier
1>.\d3dfont9.cpp(103) : error C2065: 'm_dwTexWidth' : undeclared identifier
1>.\d3dfont9.cpp(103) : error C2065: 'm_dwTexHeight' : undeclared identifier
1>.\d3dfont9.cpp(110) : error C2065: 'm_dwTexWidth' : undeclared identifier
1>.\d3dfont9.cpp(112) : error C2065: 'm_dwTexWidth' : undeclared identifier
1>.\d3dfont9.cpp(113) : error C2065: 'm_dwTexWidth' : undeclared identifier
1>.\d3dfont9.cpp(113) : error C2065: 'm_dwTexHeight' : undeclared identifier
1>.\d3dfont9.cpp(117) : error C2065: 'm_dwTexWidth' : undeclared identifier
1>.\d3dfont9.cpp(117) : error C2065: 'm_dwTexHeight' : undeclared identifier
1>.\d3dfont9.cpp(124) : error C2065: 'DWRD' : undeclared identifier
1>.\d3dfont9.cpp(124) : error C2065: 'pBitmapBits' : undeclared identifier
1>.\d3dfont9.cpp(128) : error C2065: 'm_dwTexWidth' : undeclared identifier
1>.\d3dfont9.cpp(129) : error C2065: 'm_dwTexHeight' : undeclared identifier
1>.\d3dfont9.cpp(137) : error C2065: 'pBitmapBits' : undeclared identifier
1>.\d3dfont9.cpp(142) : error C2065: 'm_dwFontHeight' : undeclared identifier
1>.\d3dfont9.cpp(144) : error C2065: 'DWRD' : undeclared identifier
1>.\d3dfont9.cpp(144) : error C2146: syntax error : missing ';' before identifier 'dwBold'
1>.\d3dfont9.cpp(144) : error C2065: 'dwBold' : undeclared identifier
1>.\d3dfont9.cpp(144) : error C2065: 'm_dwFontFlags' : undeclared identifier
1>.\d3dfont9.cpp(145) : error C2065: 'DWRD' : undeclared identifier
1>.\d3dfont9.cpp(145) : error C2146: syntax error : missing ';' before identifier 'dwItalic'
1>.\d3dfont9.cpp(145) : error C2065: 'dwItalic' : undeclared identifier
1>.\d3dfont9.cpp(145) : error C2065: 'm_dwFontFlags' : undeclared identifier
1>.\d3dfont9.cpp(146) : error C2065: 'dwBold' : undeclared identifier
1>.\d3dfont9.cpp(146) : error C2065: 'dwItalic' : undeclared identifier
1>.\d3dfont9.cpp(163) : error C2065: 'DWRD' : undeclared identifier
1>.\d3dfont9.cpp(163) : error C2146: syntax error : missing ';' before identifier 'x'
1>.\d3dfont9.cpp(163) : error C2065: 'x' : undeclared identifier
1>.\d3dfont9.cpp(164) : error C2065: 'DWRD' : undeclared identifier
1>.\d3dfont9.cpp(164) : error C2146: syntax error : missing ';' before identifier 'y'
1>.\d3dfont9.cpp(164) : error C2065: 'y' : undeclared identifier
1>.\d3dfont9.cpp(170) : error C2065: 'x' : undeclared identifier
1>.\d3dfont9.cpp(170) : error C2065: 'm_dwSpacing' : undeclared identifier
1>.\d3dfont9.cpp(170) : error C2065: 'DWRD' : undeclared identifier
1>.\d3dfont9.cpp(170) : error C2146: syntax error : missing ';' before identifier 'ceil'
1>.\d3dfont9.cpp(177) : error C2065: 'DWRD' : undeclared identifier
1>.\d3dfont9.cpp(177) : error C2065: 'x' : undeclared identifier
1>.\d3dfont9.cpp(177) : error C2065: 'm_dwSpacing' : undeclared identifier
1>.\d3dfont9.cpp(177) : error C2065: 'm_dwTexWidth' : undeclared identifier
1>.\d3dfont9.cpp(179) : error C2065: 'x' : undeclared identifier
1>.\d3dfont9.cpp(179) : error C2065: 'm_dwSpacing' : undeclared identifier
1>.\d3dfont9.cpp(180) : error C2065: 'y' : undeclared identifier
1>.\d3dfont9.cpp(183) : error C2065: 'x' : undeclared identifier
1>.\d3dfont9.cpp(183) : error C2065: 'y' : undeclared identifier
1>.\d3dfont9.cpp(185) : error C2065: 'x' : undeclared identifier
1>.\d3dfont9.cpp(185) : error C2065: 'm_dwSpacing' : undeclared identifier
1>.\d3dfont9.cpp(185) : error C2065: 'm_dwTexWidth' : undeclared identifier
1>.\d3dfont9.cpp(186) : error C2065: 'y' : undeclared identifier
1>.\d3dfont9.cpp(186) : error C2065: 'm_dwTexHeight' : undeclared identifier
1>.\d3dfont9.cpp(187) : error C2065: 'x' : undeclared identifier
1>.\d3dfont9.cpp(187) : error C2065: 'm_dwSpacing' : undeclared identifier
1>.\d3dfont9.cpp(187) : error C2065: 'm_dwTexWidth' : undeclared identifier
1>.\d3dfont9.cpp(188) : error C2065: 'y' : undeclared identifier
1>.\d3dfont9.cpp(188) : error C2065: 'm_dwTexHeight' : undeclared identifier
1>.\d3dfont9.cpp(190) : error C2065: 'x' : undeclared identifier
1>.\d3dfont9.cpp(190) : error C2065: 'm_dwSpacing' : undeclared identifier
1>.\d3dfont9.cpp(200) : error C2065: 'y' : undeclared identifier
1>.\d3dfont9.cpp(200) : error C2065: 'y' : undeclared identifier
1>.\d3dfont9.cpp(200) : error C2065: 'm_dwTexHeight' : undeclared identifier
1>.\d3dfont9.cpp(200) : error C2065: 'y' : undeclared identifier
1>.\d3dfont9.cpp(203) : error C2065: 'x' : undeclared identifier
1>.\d3dfont9.cpp(203) : error C2065: 'x' : undeclared identifier
1>.\d3dfont9.cpp(203) : error C2065: 'm_dwTexWidth' : undeclared identifier
1>.\d3dfont9.cpp(203) : error C2065: 'x' : undeclared identifier
1>.\d3dfont9.cpp(205) : error C2065: 'pBitmapBits' : undeclared identifier
1>.\d3dfont9.cpp(205) : error C2065: 'm_dwTexWidth' : undeclared identifier
1>.\d3dfont9.cpp(205) : error C2065: 'y' : undeclared identifier
1>.\d3dfont9.cpp(205) : error C2065: 'x' : undeclared identifier
1>.\d3dfont9.cpp(253) : error C2065: 'm_dwFontFlags' : undeclared identifier
1>.\d3dfont9.cpp(338) : error C2065: 'm_dwTexHeight' : undeclared identifier
1>.\d3dfont9.cpp(358) : error C2065: 'm_dwTexWidth' : undeclared identifier
1>.\d3dfont9.cpp(358) : error C2065: 'm_dwSpacing' : undeclared identifier
1>.\d3dfont9.cpp(375) : error C2061: syntax error : identifier 'DWRD'
1>.\d3dfont9.cpp(389) : error C2065: 'dwFlags' : undeclared identifier
1>.\d3dfont9.cpp(395) : error C2065: 'dwFlags' : undeclared identifier
1>.\d3dfont9.cpp(397) : error C2065: 'strText' : undeclared identifier
1>.\d3dfont9.cpp(397) : fatal error C1003: error count exceeds 100; stopping compilation
1>ass.cpp
1>.\ass.cpp(94) : error C2146: syntax error : missing ';' before identifier 'DllMain'
1>.\ass.cpp(95) : warning C4007: 'DllMain' : must be '__stdcall'
1>.\ass.cpp(95) : error C4430: missing type specifier - int assumed. Note: C++ does not support default-int
1>Build log was saved at "file://h:\Documents and Settings\User\Desktop\A5EERAN\A5EERAN\Release\BuildLog.htm"
1>A5EERAN - 116 error(s), 3 warning(s)
========== Build: 0 succeeded, 1 failed, 0 up-to-date, 0 skipped ==========
Quote Originally Posted by Dead(H)ell View Post
biggers error ever :
Code:
1>------ Build started: Project: A5EERAN, Configuration: Release Win32 ------
1>Compiling...
1>lol.cpp
1>.\lol.cpp(96) : warning C4409: illegal instruction size
1>idiot.cpp
1>.\idiot.cpp(50) : warning C4996: 'strncpy': This function or variable may be unsafe. Consider using strncpy_s instead. To disable deprecation, use _CRT_SECURE_NO_WARNINGS. See online help for details.
1>        H:\Program Files\Microsoft Visual Studio 9.0\VC\include\string.h(157) : see declaration of 'strncpy'
1>fuck.cpp
1>d3dfont9.cpp
1>h:\documents and settings\user\desktop\a5eeran\a5eeran\D3DFont9.h(33) : error C2146: syntax error : missing ';' before identifier 'm_dwFontHeight'
1>h:\documents and settings\user\desktop\a5eeran\a5eeran\D3DFont9.h(33) : error C4430: missing type specifier - int assumed. Note: C++ does not support default-int
1>h:\documents and settings\user\desktop\a5eeran\a5eeran\D3DFont9.h(33) : error C4430: missing type specifier - int assumed. Note: C++ does not support default-int
1>h:\documents and settings\user\desktop\a5eeran\a5eeran\D3DFont9.h(34) : error C2146: syntax error : missing ';' before identifier 'm_dwFontFlags'
1>h:\documents and settings\user\desktop\a5eeran\a5eeran\D3DFont9.h(34) : error C4430: missing type specifier - int assumed. Note: C++ does not support default-int
1>h:\documents and settings\user\desktop\a5eeran\a5eeran\D3DFont9.h(34) : error C4430: missing type specifier - int assumed. Note: C++ does not support default-int
1>h:\documents and settings\user\desktop\a5eeran\a5eeran\D3DFont9.h(39) : error C2146: syntax error : missing ';' before identifier 'm_dwTexWidth'
1>h:\documents and settings\user\desktop\a5eeran\a5eeran\D3DFont9.h(39) : error C4430: missing type specifier - int assumed. Note: C++ does not support default-int
1>h:\documents and settings\user\desktop\a5eeran\a5eeran\D3DFont9.h(39) : error C4430: missing type specifier - int assumed. Note: C++ does not support default-int
1>h:\documents and settings\user\desktop\a5eeran\a5eeran\D3DFont9.h(40) : error C2146: syntax error : missing ';' before identifier 'm_dwTexHeight'
1>h:\documents and settings\user\desktop\a5eeran\a5eeran\D3DFont9.h(40) : error C4430: missing type specifier - int assumed. Note: C++ does not support default-int
1>h:\documents and settings\user\desktop\a5eeran\a5eeran\D3DFont9.h(40) : error C4430: missing type specifier - int assumed. Note: C++ does not support default-int
1>h:\documents and settings\user\desktop\a5eeran\a5eeran\D3DFont9.h(43) : error C2146: syntax error : missing ';' before identifier 'm_dwSpacing'
1>h:\documents and settings\user\desktop\a5eeran\a5eeran\D3DFont9.h(43) : error C4430: missing type specifier - int assumed. Note: C++ does not support default-int
1>h:\documents and settings\user\desktop\a5eeran\a5eeran\D3DFont9.h(43) : error C4430: missing type specifier - int assumed. Note: C++ does not support default-int
1>h:\documents and settings\user\desktop\a5eeran\a5eeran\D3DFont9.h(51) : error C2061: syntax error : identifier 'DWRD'
1>h:\documents and settings\user\desktop\a5eeran\a5eeran\D3DFont9.h(54) : error C2061: syntax error : identifier 'DWRD'
1>h:\documents and settings\user\desktop\a5eeran\a5eeran\D3DFont9.h(56) : error C2061: syntax error : identifier 'DWRD'
1>h:\documents and settings\user\desktop\a5eeran\a5eeran\D3DFont9.h(68) : error C2061: syntax error : identifier 'DWRD'
1>.\d3dfont9.cpp(21) : error C2146: syntax error : missing ';' before identifier 'color'
1>.\d3dfont9.cpp(21) : error C4430: missing type specifier - int assumed. Note: C++ does not support default-int
1>.\d3dfont9.cpp(21) : error C4430: missing type specifier - int assumed. Note: C++ does not support default-int
1>.\d3dfont9.cpp(30) : error C2039: 'color' : is not a member of 'FONT2DVERTEX'
1>        .\d3dfont9.cpp(21) : see declaration of 'FONT2DVERTEX'
1>.\d3dfont9.cpp(48) : error C2061: syntax error : identifier 'DWRD'
1>.\d3dfont9.cpp(52) : error C2065: 'm_dwFontHeight' : undeclared identifier
1>.\d3dfont9.cpp(52) : error C2065: 'dwHeight' : undeclared identifier
1>.\d3dfont9.cpp(53) : error C2065: 'm_dwFontFlags' : undeclared identifier
1>.\d3dfont9.cpp(53) : error C2065: 'dwFlags' : undeclared identifier
1>.\d3dfont9.cpp(54) : error C2065: 'm_dwSpacing' : undeclared identifier
1>.\d3dfont9.cpp(96) : error C2065: 'm_dwFontHeight' : undeclared identifier
1>.\d3dfont9.cpp(97) : error C2065: 'm_dwTexWidth' : undeclared identifier
1>.\d3dfont9.cpp(97) : error C2065: 'm_dwTexHeight' : undeclared identifier
1>.\d3dfont9.cpp(98) : error C2065: 'm_dwFontHeight' : undeclared identifier
1>.\d3dfont9.cpp(99) : error C2065: 'm_dwTexWidth' : undeclared identifier
1>.\d3dfont9.cpp(99) : error C2065: 'm_dwTexHeight' : undeclared identifier
1>.\d3dfont9.cpp(100) : error C2065: 'm_dwFontHeight' : undeclared identifier
1>.\d3dfont9.cpp(101) : error C2065: 'm_dwTexWidth' : undeclared identifier
1>.\d3dfont9.cpp(101) : error C2065: 'm_dwTexHeight' : undeclared identifier
1>.\d3dfont9.cpp(103) : error C2065: 'm_dwTexWidth' : undeclared identifier
1>.\d3dfont9.cpp(103) : error C2065: 'm_dwTexHeight' : undeclared identifier
1>.\d3dfont9.cpp(110) : error C2065: 'm_dwTexWidth' : undeclared identifier
1>.\d3dfont9.cpp(112) : error C2065: 'm_dwTexWidth' : undeclared identifier
1>.\d3dfont9.cpp(113) : error C2065: 'm_dwTexWidth' : undeclared identifier
1>.\d3dfont9.cpp(113) : error C2065: 'm_dwTexHeight' : undeclared identifier
1>.\d3dfont9.cpp(117) : error C2065: 'm_dwTexWidth' : undeclared identifier
1>.\d3dfont9.cpp(117) : error C2065: 'm_dwTexHeight' : undeclared identifier
1>.\d3dfont9.cpp(124) : error C2065: 'DWRD' : undeclared identifier
1>.\d3dfont9.cpp(124) : error C2065: 'pBitmapBits' : undeclared identifier
1>.\d3dfont9.cpp(128) : error C2065: 'm_dwTexWidth' : undeclared identifier
1>.\d3dfont9.cpp(129) : error C2065: 'm_dwTexHeight' : undeclared identifier
1>.\d3dfont9.cpp(137) : error C2065: 'pBitmapBits' : undeclared identifier
1>.\d3dfont9.cpp(142) : error C2065: 'm_dwFontHeight' : undeclared identifier
1>.\d3dfont9.cpp(144) : error C2065: 'DWRD' : undeclared identifier
1>.\d3dfont9.cpp(144) : error C2146: syntax error : missing ';' before identifier 'dwBold'
1>.\d3dfont9.cpp(144) : error C2065: 'dwBold' : undeclared identifier
1>.\d3dfont9.cpp(144) : error C2065: 'm_dwFontFlags' : undeclared identifier
1>.\d3dfont9.cpp(145) : error C2065: 'DWRD' : undeclared identifier
1>.\d3dfont9.cpp(145) : error C2146: syntax error : missing ';' before identifier 'dwItalic'
1>.\d3dfont9.cpp(145) : error C2065: 'dwItalic' : undeclared identifier
1>.\d3dfont9.cpp(145) : error C2065: 'm_dwFontFlags' : undeclared identifier
1>.\d3dfont9.cpp(146) : error C2065: 'dwBold' : undeclared identifier
1>.\d3dfont9.cpp(146) : error C2065: 'dwItalic' : undeclared identifier
1>.\d3dfont9.cpp(163) : error C2065: 'DWRD' : undeclared identifier
1>.\d3dfont9.cpp(163) : error C2146: syntax error : missing ';' before identifier 'x'
1>.\d3dfont9.cpp(163) : error C2065: 'x' : undeclared identifier
1>.\d3dfont9.cpp(164) : error C2065: 'DWRD' : undeclared identifier
1>.\d3dfont9.cpp(164) : error C2146: syntax error : missing ';' before identifier 'y'
1>.\d3dfont9.cpp(164) : error C2065: 'y' : undeclared identifier
1>.\d3dfont9.cpp(170) : error C2065: 'x' : undeclared identifier
1>.\d3dfont9.cpp(170) : error C2065: 'm_dwSpacing' : undeclared identifier
1>.\d3dfont9.cpp(170) : error C2065: 'DWRD' : undeclared identifier
1>.\d3dfont9.cpp(170) : error C2146: syntax error : missing ';' before identifier 'ceil'
1>.\d3dfont9.cpp(177) : error C2065: 'DWRD' : undeclared identifier
1>.\d3dfont9.cpp(177) : error C2065: 'x' : undeclared identifier
1>.\d3dfont9.cpp(177) : error C2065: 'm_dwSpacing' : undeclared identifier
1>.\d3dfont9.cpp(177) : error C2065: 'm_dwTexWidth' : undeclared identifier
1>.\d3dfont9.cpp(179) : error C2065: 'x' : undeclared identifier
1>.\d3dfont9.cpp(179) : error C2065: 'm_dwSpacing' : undeclared identifier
1>.\d3dfont9.cpp(180) : error C2065: 'y' : undeclared identifier
1>.\d3dfont9.cpp(183) : error C2065: 'x' : undeclared identifier
1>.\d3dfont9.cpp(183) : error C2065: 'y' : undeclared identifier
1>.\d3dfont9.cpp(185) : error C2065: 'x' : undeclared identifier
1>.\d3dfont9.cpp(185) : error C2065: 'm_dwSpacing' : undeclared identifier
1>.\d3dfont9.cpp(185) : error C2065: 'm_dwTexWidth' : undeclared identifier
1>.\d3dfont9.cpp(186) : error C2065: 'y' : undeclared identifier
1>.\d3dfont9.cpp(186) : error C2065: 'm_dwTexHeight' : undeclared identifier
1>.\d3dfont9.cpp(187) : error C2065: 'x' : undeclared identifier
1>.\d3dfont9.cpp(187) : error C2065: 'm_dwSpacing' : undeclared identifier
1>.\d3dfont9.cpp(187) : error C2065: 'm_dwTexWidth' : undeclared identifier
1>.\d3dfont9.cpp(188) : error C2065: 'y' : undeclared identifier
1>.\d3dfont9.cpp(188) : error C2065: 'm_dwTexHeight' : undeclared identifier
1>.\d3dfont9.cpp(190) : error C2065: 'x' : undeclared identifier
1>.\d3dfont9.cpp(190) : error C2065: 'm_dwSpacing' : undeclared identifier
1>.\d3dfont9.cpp(200) : error C2065: 'y' : undeclared identifier
1>.\d3dfont9.cpp(200) : error C2065: 'y' : undeclared identifier
1>.\d3dfont9.cpp(200) : error C2065: 'm_dwTexHeight' : undeclared identifier
1>.\d3dfont9.cpp(200) : error C2065: 'y' : undeclared identifier
1>.\d3dfont9.cpp(203) : error C2065: 'x' : undeclared identifier
1>.\d3dfont9.cpp(203) : error C2065: 'x' : undeclared identifier
1>.\d3dfont9.cpp(203) : error C2065: 'm_dwTexWidth' : undeclared identifier
1>.\d3dfont9.cpp(203) : error C2065: 'x' : undeclared identifier
1>.\d3dfont9.cpp(205) : error C2065: 'pBitmapBits' : undeclared identifier
1>.\d3dfont9.cpp(205) : error C2065: 'm_dwTexWidth' : undeclared identifier
1>.\d3dfont9.cpp(205) : error C2065: 'y' : undeclared identifier
1>.\d3dfont9.cpp(205) : error C2065: 'x' : undeclared identifier
1>.\d3dfont9.cpp(253) : error C2065: 'm_dwFontFlags' : undeclared identifier
1>.\d3dfont9.cpp(338) : error C2065: 'm_dwTexHeight' : undeclared identifier
1>.\d3dfont9.cpp(358) : error C2065: 'm_dwTexWidth' : undeclared identifier
1>.\d3dfont9.cpp(358) : error C2065: 'm_dwSpacing' : undeclared identifier
1>.\d3dfont9.cpp(375) : error C2061: syntax error : identifier 'DWRD'
1>.\d3dfont9.cpp(389) : error C2065: 'dwFlags' : undeclared identifier
1>.\d3dfont9.cpp(395) : error C2065: 'dwFlags' : undeclared identifier
1>.\d3dfont9.cpp(397) : error C2065: 'strText' : undeclared identifier
1>.\d3dfont9.cpp(397) : fatal error C1003: error count exceeds 100; stopping compilation
1>ass.cpp
1>.\ass.cpp(94) : error C2146: syntax error : missing ';' before identifier 'DllMain'
1>.\ass.cpp(95) : warning C4007: 'DllMain' : must be '__stdcall'
1>.\ass.cpp(95) : error C4430: missing type specifier - int assumed. Note: C++ does not support default-int
1>Build log was saved at "file://h:\Documents and Settings\User\Desktop\A5EERAN\A5EERAN\Release\BuildLog.htm"
1>A5EERAN - 116 error(s), 3 warning(s)
========== Build: 0 succeeded, 1 failed, 0 up-to-date, 0 skipped ==========


That;s happens when you copy and paste Shit xD
If you would understand what i am trying to say than you wouldn't be taking it offensively.
Quote Originally Posted by ToXiC Coder View Post




That;s happens when you copy and paste Shit xD
That's a warning, please be respectful.
Quote Originally Posted by JusCaus View Post
That's a warning, please be respectful.
Dude.. lol what's there to show respect Just saying when you C+P you get errors like that
Quote Originally Posted by ToXiC Coder View Post


Dude.. lol what's there to show respect Just saying when you C+P you get errors like that
I was just playing with you.... relax..
Quote Originally Posted by Dead(H)ell View Post
biggers error ever :
Code:
1>------ Build started: Project: A5EERAN, Configuration: Release Win32 ------
1>Compiling...
1>lol.cpp
1>.\lol.cpp(96) : warning C4409: illegal instruction size
1>idiot.cpp
1>.\idiot.cpp(50) : warning C4996: 'strncpy': This function or variable may be unsafe. Consider using strncpy_s instead. To disable deprecation, use _CRT_SECURE_NO_WARNINGS. See online help for details.
1>        H:\Program Files\Microsoft Visual Studio 9.0\VC\include\string.h(157) : see declaration of 'strncpy'
1>fuck.cpp
1>d3dfont9.cpp
1>h:\documents and settings\user\desktop\a5eeran\a5eeran\D3DFont9.h(33) : error C2146: syntax error : missing ';' before identifier 'm_dwFontHeight'
1>h:\documents and settings\user\desktop\a5eeran\a5eeran\D3DFont9.h(33) : error C4430: missing type specifier - int assumed. Note: C++ does not support default-int
1>h:\documents and settings\user\desktop\a5eeran\a5eeran\D3DFont9.h(33) : error C4430: missing type specifier - int assumed. Note: C++ does not support default-int
1>h:\documents and settings\user\desktop\a5eeran\a5eeran\D3DFont9.h(34) : error C2146: syntax error : missing ';' before identifier 'm_dwFontFlags'
1>h:\documents and settings\user\desktop\a5eeran\a5eeran\D3DFont9.h(34) : error C4430: missing type specifier - int assumed. Note: C++ does not support default-int
1>h:\documents and settings\user\desktop\a5eeran\a5eeran\D3DFont9.h(34) : error C4430: missing type specifier - int assumed. Note: C++ does not support default-int
1>h:\documents and settings\user\desktop\a5eeran\a5eeran\D3DFont9.h(39) : error C2146: syntax error : missing ';' before identifier 'm_dwTexWidth'
1>h:\documents and settings\user\desktop\a5eeran\a5eeran\D3DFont9.h(39) : error C4430: missing type specifier - int assumed. Note: C++ does not support default-int
1>h:\documents and settings\user\desktop\a5eeran\a5eeran\D3DFont9.h(39) : error C4430: missing type specifier - int assumed. Note: C++ does not support default-int
1>h:\documents and settings\user\desktop\a5eeran\a5eeran\D3DFont9.h(40) : error C2146: syntax error : missing ';' before identifier 'm_dwTexHeight'
1>h:\documents and settings\user\desktop\a5eeran\a5eeran\D3DFont9.h(40) : error C4430: missing type specifier - int assumed. Note: C++ does not support default-int
1>h:\documents and settings\user\desktop\a5eeran\a5eeran\D3DFont9.h(40) : error C4430: missing type specifier - int assumed. Note: C++ does not support default-int
1>h:\documents and settings\user\desktop\a5eeran\a5eeran\D3DFont9.h(43) : error C2146: syntax error : missing ';' before identifier 'm_dwSpacing'
1>h:\documents and settings\user\desktop\a5eeran\a5eeran\D3DFont9.h(43) : error C4430: missing type specifier - int assumed. Note: C++ does not support default-int
1>h:\documents and settings\user\desktop\a5eeran\a5eeran\D3DFont9.h(43) : error C4430: missing type specifier - int assumed. Note: C++ does not support default-int
1>h:\documents and settings\user\desktop\a5eeran\a5eeran\D3DFont9.h(51) : error C2061: syntax error : identifier 'DWRD'
1>h:\documents and settings\user\desktop\a5eeran\a5eeran\D3DFont9.h(54) : error C2061: syntax error : identifier 'DWRD'
1>h:\documents and settings\user\desktop\a5eeran\a5eeran\D3DFont9.h(56) : error C2061: syntax error : identifier 'DWRD'
1>h:\documents and settings\user\desktop\a5eeran\a5eeran\D3DFont9.h(68) : error C2061: syntax error : identifier 'DWRD'
1>.\d3dfont9.cpp(21) : error C2146: syntax error : missing ';' before identifier 'color'
1>.\d3dfont9.cpp(21) : error C4430: missing type specifier - int assumed. Note: C++ does not support default-int
1>.\d3dfont9.cpp(21) : error C4430: missing type specifier - int assumed. Note: C++ does not support default-int
1>.\d3dfont9.cpp(30) : error C2039: 'color' : is not a member of 'FONT2DVERTEX'
1>        .\d3dfont9.cpp(21) : see declaration of 'FONT2DVERTEX'
1>.\d3dfont9.cpp(48) : error C2061: syntax error : identifier 'DWRD'
1>.\d3dfont9.cpp(52) : error C2065: 'm_dwFontHeight' : undeclared identifier
1>.\d3dfont9.cpp(52) : error C2065: 'dwHeight' : undeclared identifier
1>.\d3dfont9.cpp(53) : error C2065: 'm_dwFontFlags' : undeclared identifier
1>.\d3dfont9.cpp(53) : error C2065: 'dwFlags' : undeclared identifier
1>.\d3dfont9.cpp(54) : error C2065: 'm_dwSpacing' : undeclared identifier
1>.\d3dfont9.cpp(96) : error C2065: 'm_dwFontHeight' : undeclared identifier
1>.\d3dfont9.cpp(97) : error C2065: 'm_dwTexWidth' : undeclared identifier
1>.\d3dfont9.cpp(97) : error C2065: 'm_dwTexHeight' : undeclared identifier
1>.\d3dfont9.cpp(98) : error C2065: 'm_dwFontHeight' : undeclared identifier
1>.\d3dfont9.cpp(99) : error C2065: 'm_dwTexWidth' : undeclared identifier
1>.\d3dfont9.cpp(99) : error C2065: 'm_dwTexHeight' : undeclared identifier
1>.\d3dfont9.cpp(100) : error C2065: 'm_dwFontHeight' : undeclared identifier
1>.\d3dfont9.cpp(101) : error C2065: 'm_dwTexWidth' : undeclared identifier
1>.\d3dfont9.cpp(101) : error C2065: 'm_dwTexHeight' : undeclared identifier
1>.\d3dfont9.cpp(103) : error C2065: 'm_dwTexWidth' : undeclared identifier
1>.\d3dfont9.cpp(103) : error C2065: 'm_dwTexHeight' : undeclared identifier
1>.\d3dfont9.cpp(110) : error C2065: 'm_dwTexWidth' : undeclared identifier
1>.\d3dfont9.cpp(112) : error C2065: 'm_dwTexWidth' : undeclared identifier
1>.\d3dfont9.cpp(113) : error C2065: 'm_dwTexWidth' : undeclared identifier
1>.\d3dfont9.cpp(113) : error C2065: 'm_dwTexHeight' : undeclared identifier
1>.\d3dfont9.cpp(117) : error C2065: 'm_dwTexWidth' : undeclared identifier
1>.\d3dfont9.cpp(117) : error C2065: 'm_dwTexHeight' : undeclared identifier
1>.\d3dfont9.cpp(124) : error C2065: 'DWRD' : undeclared identifier
1>.\d3dfont9.cpp(124) : error C2065: 'pBitmapBits' : undeclared identifier
1>.\d3dfont9.cpp(128) : error C2065: 'm_dwTexWidth' : undeclared identifier
1>.\d3dfont9.cpp(129) : error C2065: 'm_dwTexHeight' : undeclared identifier
1>.\d3dfont9.cpp(137) : error C2065: 'pBitmapBits' : undeclared identifier
1>.\d3dfont9.cpp(142) : error C2065: 'm_dwFontHeight' : undeclared identifier
1>.\d3dfont9.cpp(144) : error C2065: 'DWRD' : undeclared identifier
1>.\d3dfont9.cpp(144) : error C2146: syntax error : missing ';' before identifier 'dwBold'
1>.\d3dfont9.cpp(144) : error C2065: 'dwBold' : undeclared identifier
1>.\d3dfont9.cpp(144) : error C2065: 'm_dwFontFlags' : undeclared identifier
1>.\d3dfont9.cpp(145) : error C2065: 'DWRD' : undeclared identifier
1>.\d3dfont9.cpp(145) : error C2146: syntax error : missing ';' before identifier 'dwItalic'
1>.\d3dfont9.cpp(145) : error C2065: 'dwItalic' : undeclared identifier
1>.\d3dfont9.cpp(145) : error C2065: 'm_dwFontFlags' : undeclared identifier
1>.\d3dfont9.cpp(146) : error C2065: 'dwBold' : undeclared identifier
1>.\d3dfont9.cpp(146) : error C2065: 'dwItalic' : undeclared identifier
1>.\d3dfont9.cpp(163) : error C2065: 'DWRD' : undeclared identifier
1>.\d3dfont9.cpp(163) : error C2146: syntax error : missing ';' before identifier 'x'
1>.\d3dfont9.cpp(163) : error C2065: 'x' : undeclared identifier
1>.\d3dfont9.cpp(164) : error C2065: 'DWRD' : undeclared identifier
1>.\d3dfont9.cpp(164) : error C2146: syntax error : missing ';' before identifier 'y'
1>.\d3dfont9.cpp(164) : error C2065: 'y' : undeclared identifier
1>.\d3dfont9.cpp(170) : error C2065: 'x' : undeclared identifier
1>.\d3dfont9.cpp(170) : error C2065: 'm_dwSpacing' : undeclared identifier
1>.\d3dfont9.cpp(170) : error C2065: 'DWRD' : undeclared identifier
1>.\d3dfont9.cpp(170) : error C2146: syntax error : missing ';' before identifier 'ceil'
1>.\d3dfont9.cpp(177) : error C2065: 'DWRD' : undeclared identifier
1>.\d3dfont9.cpp(177) : error C2065: 'x' : undeclared identifier
1>.\d3dfont9.cpp(177) : error C2065: 'm_dwSpacing' : undeclared identifier
1>.\d3dfont9.cpp(177) : error C2065: 'm_dwTexWidth' : undeclared identifier
1>.\d3dfont9.cpp(179) : error C2065: 'x' : undeclared identifier
1>.\d3dfont9.cpp(179) : error C2065: 'm_dwSpacing' : undeclared identifier
1>.\d3dfont9.cpp(180) : error C2065: 'y' : undeclared identifier
1>.\d3dfont9.cpp(183) : error C2065: 'x' : undeclared identifier
1>.\d3dfont9.cpp(183) : error C2065: 'y' : undeclared identifier
1>.\d3dfont9.cpp(185) : error C2065: 'x' : undeclared identifier
1>.\d3dfont9.cpp(185) : error C2065: 'm_dwSpacing' : undeclared identifier
1>.\d3dfont9.cpp(185) : error C2065: 'm_dwTexWidth' : undeclared identifier
1>.\d3dfont9.cpp(186) : error C2065: 'y' : undeclared identifier
1>.\d3dfont9.cpp(186) : error C2065: 'm_dwTexHeight' : undeclared identifier
1>.\d3dfont9.cpp(187) : error C2065: 'x' : undeclared identifier
1>.\d3dfont9.cpp(187) : error C2065: 'm_dwSpacing' : undeclared identifier
1>.\d3dfont9.cpp(187) : error C2065: 'm_dwTexWidth' : undeclared identifier
1>.\d3dfont9.cpp(188) : error C2065: 'y' : undeclared identifier
1>.\d3dfont9.cpp(188) : error C2065: 'm_dwTexHeight' : undeclared identifier
1>.\d3dfont9.cpp(190) : error C2065: 'x' : undeclared identifier
1>.\d3dfont9.cpp(190) : error C2065: 'm_dwSpacing' : undeclared identifier
1>.\d3dfont9.cpp(200) : error C2065: 'y' : undeclared identifier
1>.\d3dfont9.cpp(200) : error C2065: 'y' : undeclared identifier
1>.\d3dfont9.cpp(200) : error C2065: 'm_dwTexHeight' : undeclared identifier
1>.\d3dfont9.cpp(200) : error C2065: 'y' : undeclared identifier
1>.\d3dfont9.cpp(203) : error C2065: 'x' : undeclared identifier
1>.\d3dfont9.cpp(203) : error C2065: 'x' : undeclared identifier
1>.\d3dfont9.cpp(203) : error C2065: 'm_dwTexWidth' : undeclared identifier
1>.\d3dfont9.cpp(203) : error C2065: 'x' : undeclared identifier
1>.\d3dfont9.cpp(205) : error C2065: 'pBitmapBits' : undeclared identifier
1>.\d3dfont9.cpp(205) : error C2065: 'm_dwTexWidth' : undeclared identifier
1>.\d3dfont9.cpp(205) : error C2065: 'y' : undeclared identifier
1>.\d3dfont9.cpp(205) : error C2065: 'x' : undeclared identifier
1>.\d3dfont9.cpp(253) : error C2065: 'm_dwFontFlags' : undeclared identifier
1>.\d3dfont9.cpp(338) : error C2065: 'm_dwTexHeight' : undeclared identifier
1>.\d3dfont9.cpp(358) : error C2065: 'm_dwTexWidth' : undeclared identifier
1>.\d3dfont9.cpp(358) : error C2065: 'm_dwSpacing' : undeclared identifier
1>.\d3dfont9.cpp(375) : error C2061: syntax error : identifier 'DWRD'
1>.\d3dfont9.cpp(389) : error C2065: 'dwFlags' : undeclared identifier
1>.\d3dfont9.cpp(395) : error C2065: 'dwFlags' : undeclared identifier
1>.\d3dfont9.cpp(397) : error C2065: 'strText' : undeclared identifier
1>.\d3dfont9.cpp(397) : fatal error C1003: error count exceeds 100; stopping compilation
1>ass.cpp
1>.\ass.cpp(94) : error C2146: syntax error : missing ';' before identifier 'DllMain'
1>.\ass.cpp(95) : warning C4007: 'DllMain' : must be '__stdcall'
1>.\ass.cpp(95) : error C4430: missing type specifier - int assumed. Note: C++ does not support default-int
1>Build log was saved at "file://h:\Documents and Settings\User\Desktop\A5EERAN\A5EERAN\Release\BuildLog.htm"
1>A5EERAN - 116 error(s), 3 warning(s)
========== Build: 0 succeeded, 1 failed, 0 up-to-date, 0 skipped ==========
You got those errors because your or someone removed some functions of the base.
Posts 16–30 of 47 · Page 2 of 4

Post a Reply

Similar Threads

Tags for this Thread

None

Talk with us