me ajudem aki com esse erro na hora de compilar
está dando esse erro aki:
1>------ Build started: Project: [W]eb[S] DLL Hacker 1.4, Configuration: Debug Win32 ------
1>Compiling...
1>aimbot.cpp
1>c:\users\vitor\desktop\private\bases\gellin\ca_u nk_base_v1\[w]eb[s] dll hacker 1.4\files.h(52) : fatal error C1083: Cannot open include file: 'C:\crasher\message.h': No such file or directory
1>d3d.cpp
1>c:\users\vitor\desktop\private\bases\gellin\ca_u nk_base_v1\[w]eb[s] dll hacker 1.4\files.h(52) : fatal error C1083: Cannot open include file: 'C:\crasher\message.h': No such file or directory
1>engine.cpp
1>c:\users\vitor\desktop\private\bases\gellin\ca_u nk_base_v1\[w]eb[s] dll hacker 1.4\files.h(52) : fatal error C1083: Cannot open include file: 'C:\crasher\message.h': No such file or directory
1>esp.cpp
1>c:\users\vitor\desktop\private\bases\gellin\ca_u nk_base_v1\[w]eb[s] dll hacker 1.4\files.h(52) : fatal error C1083: Cannot open include file: 'C:\crasher\message.h': No such file or directory
1>hacks.cpp
1>c:\users\vitor\desktop\private\bases\gellin\ca_u nk_base_v1\[w]eb[s] dll hacker 1.4\files.h(52) : fatal error C1083: Cannot open include file: 'C:\crasher\message.h': No such file or directory
1>main.cpp
1>c:\users\vitor\desktop\private\bases\gellin\ca_u nk_base_v1\[w]eb[s] dll hacker 1.4\files.h(52) : fatal error C1083: Cannot open include file: 'C:\crasher\message.h': No such file or directory
1>menu.cpp
1>c:\users\vitor\desktop\private\bases\gellin\ca_u nk_base_v1\[w]eb[s] dll hacker 1.4\files.h(52) : fatal error C1083: Cannot open include file: 'C:\crasher\message.h': No such file or directory
1>tools.cpp
1>c:\users\vitor\desktop\private\bases\gellin\ca_u nk_base_v1\[w]eb[s] dll hacker 1.4\files.h(52) : fatal error C1083: Cannot open include file: 'C:\crasher\message.h': No such file or directory
1>Generating Code...
1>Build log was saved at "file://c:\Users\Vitor\Desktop\Private\bases\GELLIN\CA_unk _base_v1\[W]eb[S] DLL Hacker 1.4\Debug\BuildLog.htm"
1>[W]eb[S] DLL Hacker 1.4 - 8 error(s), 0 warning(s)
========== Build: 0 succeeded, 1 failed, 0 up-to-date, 0 skipped ==========
me ajudem!
1>------ Build started: Project: [W]eb[S] DLL Hacker 1.4, Configuration: Debug Win32 ------
1>Compiling...
1>aimbot.cpp
1>c:\users\vitor\desktop\private\bases\gellin\ca_u nk_base_v1\[w]eb[s] dll hacker 1.4\files.h(52) : fatal error C1083: Cannot open include file: 'C:\crasher\message.h': No such file or directory
1>d3d.cpp
1>c:\users\vitor\desktop\private\bases\gellin\ca_u nk_base_v1\[w]eb[s] dll hacker 1.4\files.h(52) : fatal error C1083: Cannot open include file: 'C:\crasher\message.h': No such file or directory
1>engine.cpp
1>c:\users\vitor\desktop\private\bases\gellin\ca_u nk_base_v1\[w]eb[s] dll hacker 1.4\files.h(52) : fatal error C1083: Cannot open include file: 'C:\crasher\message.h': No such file or directory
1>esp.cpp
1>c:\users\vitor\desktop\private\bases\gellin\ca_u nk_base_v1\[w]eb[s] dll hacker 1.4\files.h(52) : fatal error C1083: Cannot open include file: 'C:\crasher\message.h': No such file or directory
1>hacks.cpp
1>c:\users\vitor\desktop\private\bases\gellin\ca_u nk_base_v1\[w]eb[s] dll hacker 1.4\files.h(52) : fatal error C1083: Cannot open include file: 'C:\crasher\message.h': No such file or directory
1>main.cpp
1>c:\users\vitor\desktop\private\bases\gellin\ca_u nk_base_v1\[w]eb[s] dll hacker 1.4\files.h(52) : fatal error C1083: Cannot open include file: 'C:\crasher\message.h': No such file or directory
1>menu.cpp
1>c:\users\vitor\desktop\private\bases\gellin\ca_u nk_base_v1\[w]eb[s] dll hacker 1.4\files.h(52) : fatal error C1083: Cannot open include file: 'C:\crasher\message.h': No such file or directory
1>tools.cpp
1>c:\users\vitor\desktop\private\bases\gellin\ca_u nk_base_v1\[w]eb[s] dll hacker 1.4\files.h(52) : fatal error C1083: Cannot open include file: 'C:\crasher\message.h': No such file or directory
1>Generating Code...
1>Build log was saved at "file://c:\Users\Vitor\Desktop\Private\bases\GELLIN\CA_unk _base_v1\[W]eb[S] DLL Hacker 1.4\Debug\BuildLog.htm"
1>[W]eb[S] DLL Hacker 1.4 - 8 error(s), 0 warning(s)
========== Build: 0 succeeded, 1 failed, 0 up-to-date, 0 skipped ==========
me ajudem!
