HelpAlguem me ajuda ?

Posts 1–6 of 6 · Page 1 of 1
Alguem me ajuda ?
Gente precizo da ajuda de vcs fui colocar Aim Correction na minha base e deu varios erros eu nao consegui arrumar por isso vim aqui para ver se vcs me ajudam?

Erros:

Code:
1>------ Build started: Project: CABASE, Configuration: Release Win32 ------
1>  Base.cpp
1>c:\users\matheus\desktop\uteis & hacks\bases sem dc\cabaseatt\Itens.h(261): error C2653: 'cHacks' : is not a class or namespace name
1>c:\users\matheus\desktop\uteis & hacks\bases sem dc\cabaseatt\Itens.h(262): error C2601: 'AimCorrection' : local function definitions are illegal
1>          c:\users\matheus\desktop\uteis & hacks\bases sem dc\cabaseatt\Itens.h(105): this line contains a '{' which has not yet been matched
1>c:\users\matheus\desktop\uteis & hacks\bases sem dc\cabaseatt\Itens.h(275): error C2109: subscript requires array or pointer type
1>c:\users\matheus\desktop\uteis & hacks\bases sem dc\cabaseatt\Itens.h(276): error C2109: subscript requires array or pointer type
1>c:\users\matheus\desktop\uteis & hacks\bases sem dc\cabaseatt\Itens.h(277): error C2109: subscript requires array or pointer type
1>c:\users\matheus\desktop\uteis & hacks\bases sem dc\cabaseatt\Itens.h(278): error C2109: subscript requires array or pointer type
1>c:\users\matheus\desktop\uteis & hacks\bases sem dc\cabaseatt\Itens.h(279): error C2109: subscript requires array or pointer type
1>c:\users\matheus\desktop\uteis & hacks\bases sem dc\cabaseatt\Itens.h(280): error C2109: subscript requires array or pointer type
1>c:\users\matheus\desktop\uteis & hacks\bases sem dc\cabaseatt\Itens.h(281): error C2109: subscript requires array or pointer type
1>c:\users\matheus\desktop\uteis & hacks\bases sem dc\cabaseatt\Itens.h(282): error C2109: subscript requires array or pointer type
1>c:\users\matheus\desktop\uteis & hacks\bases sem dc\cabaseatt\Itens.h(283): error C2109: subscript requires array or pointer type
1>c:\users\matheus\desktop\uteis & hacks\bases sem dc\cabaseatt\Itens.h(284): error C2109: subscript requires array or pointer type
1>c:\users\matheus\desktop\uteis & hacks\bases sem dc\cabaseatt\Itens.h(285): error C2109: subscript requires array or pointer type
1>c:\users\matheus\desktop\uteis & hacks\bases sem dc\cabaseatt\Itens.h(286): error C2109: subscript requires array or pointer type
1>c:\users\matheus\desktop\uteis & hacks\bases sem dc\cabaseatt\Itens.h(287): error C2109: subscript requires array or pointer type
1>c:\users\matheus\desktop\uteis & hacks\bases sem dc\cabaseatt\Itens.h(288): error C2109: subscript requires array or pointer type
1>c:\users\matheus\desktop\uteis & hacks\bases sem dc\cabaseatt\Itens.h(289): error C2109: subscript requires array or pointer type
1>c:\users\matheus\desktop\uteis & hacks\bases sem dc\cabaseatt\Itens.h(290): error C2109: subscript requires array or pointer type
1>c:\users\matheus\desktop\uteis & hacks\bases sem dc\cabaseatt\Itens.h(291): error C2109: subscript requires array or pointer type
1>c:\users\matheus\desktop\uteis & hacks\bases sem dc\cabaseatt\Itens.h(292): error C2109: subscript requires array or pointer type
1>c:\users\matheus\desktop\uteis & hacks\bases sem dc\cabaseatt\Itens.h(293): error C2109: subscript requires array or pointer type
1>c:\users\matheus\desktop\uteis & hacks\bases sem dc\cabaseatt\Itens.h(294): error C2109: subscript requires array or pointer type
1>c:\users\matheus\desktop\uteis & hacks\bases sem dc\cabaseatt\Itens.h(358): error C2109: subscript requires array or pointer type
1>c:\users\matheus\desktop\uteis & hacks\bases sem dc\cabaseatt\Itens.h(359): error C2109: subscript requires array or pointer type
1>c:\users\matheus\desktop\uteis & hacks\bases sem dc\cabaseatt\Itens.h(360): error C2109: subscript requires array or pointer type
1>c:\users\matheus\desktop\uteis & hacks\bases sem dc\cabaseatt\Itens.h(361): error C2109: subscript requires array or pointer type
1>c:\users\matheus\desktop\uteis & hacks\bases sem dc\cabaseatt\Itens.h(362): error C2109: subscript requires array or pointer type
1>c:\users\matheus\desktop\uteis & hacks\bases sem dc\cabaseatt\Itens.h(363): error C2109: subscript requires array or pointer type
1>c:\users\matheus\desktop\uteis & hacks\bases sem dc\cabaseatt\Itens.h(364): error C2109: subscript requires array or pointer type
1>c:\users\matheus\desktop\uteis & hacks\bases sem dc\cabaseatt\Itens.h(365): error C2109: subscript requires array or pointer type
1>c:\users\matheus\desktop\uteis & hacks\bases sem dc\cabaseatt\Itens.h(366): error C2109: subscript requires array or pointer type
1>c:\users\matheus\desktop\uteis & hacks\bases sem dc\cabaseatt\Itens.h(367): error C2109: subscript requires array or pointer type
1>c:\users\matheus\desktop\uteis & hacks\bases sem dc\cabaseatt\Itens.h(368): error C2109: subscript requires array or pointer type
1>c:\users\matheus\desktop\uteis & hacks\bases sem dc\cabaseatt\Itens.h(369): error C2109: subscript requires array or pointer type
1>c:\users\matheus\desktop\uteis & hacks\bases sem dc\cabaseatt\Itens.h(370): error C2109: subscript requires array or pointer type
1>c:\users\matheus\desktop\uteis & hacks\bases sem dc\cabaseatt\Itens.h(371): error C2109: subscript requires array or pointer type
1>c:\users\matheus\desktop\uteis & hacks\bases sem dc\cabaseatt\Itens.h(372): error C2109: subscript requires array or pointer type
1>c:\users\matheus\desktop\uteis & hacks\bases sem dc\cabaseatt\Itens.h(373): error C2109: subscript requires array or pointer type
1>c:\users\matheus\desktop\uteis & hacks\bases sem dc\cabaseatt\Itens.h(374): error C2109: subscript requires array or pointer type
1>c:\users\matheus\desktop\uteis & hacks\bases sem dc\cabaseatt\Itens.h(375): error C2109: subscript requires array or pointer type
1>c:\users\matheus\desktop\uteis & hacks\bases sem dc\cabaseatt\Itens.h(376): error C2109: subscript requires array or pointer type
1>c:\users\matheus\desktop\uteis & hacks\bases sem dc\cabaseatt\Itens.h(377): error C2109: subscript requires array or pointer type
========== Build: 0 succeeded, 1 failed, 0 up-to-date, 0 skipped ==========
eu estou usando esse Code

Code:
void cHacks::AimCorrection( bool Correct )
{
	if( !StoreWepData )
	{	
		cWeaponMgr* WepMgr = *(cWeaponMgr**)ADDR_WEAPONMGR;
			
		if( WepMgr )
		{
			for( int i = 0; i < WepMgr->WeaponCount; i++ )
			{ 
				cWeaponInfo* Wep = WepMgr->Weapons[i];

				if( Wep ) 
				{	
					OgAwepData[0][i] = Wep->fDuckPerturb;
					OgAwepData[1][i] = Wep->fMoveDuckPerturb;
					OgAwepData[2][i] = Wep->fPerturbIncSpeed;
					OgAwepData[3][i] = Wep->fPerturbDecSpeed;
					OgAwepData[4][i] = Wep->fCameraSwayXFreq;
					OgAwepData[5][i] = Wep->fCameraSwayYFreq;
					OgAwepData[6][i] = Wep->fZoomedPerturbIncSpeed;
					OgAwepData[7][i] = Wep->fZoomedPerturbDecSpeed; 
					OgAwepData[8][i] = Wep->fTripleShotMaxCamRecoilPitch;
					OgAwepData[9][i] = Wep->fTripleShotBaseCamRecoilPitch;
					OgAwepData[10][i] = Wep->fTripleShotPerturbIncSpeed;
					OgAwepData[11][i] = Wep->fTripleShotPerturbDecSpeed;
					OgAwepData[12][i] = Wep->fBaseCamRecoilPitch;
					OgAwepData[13][i] = Wep->fBaseCamRecoilAccelPitch;
					OgAwepData[14][i] = Wep->dwTripleShotMinPerturb;
					OgAwepData[15][i] = Wep->dwTripleShotMaxPerturb;
					OgAwepData[16][i] = Wep->dwMaxPerturb;
					OgAwepData[17][i] = Wep->dwMinPerturb;
					OgAwepData[18][i] = Wep->dwZoomedMaxPerturb;
					OgAwepData[19][i] = Wep->dwZoomedMinPerturb;
				} 
			}
		}
		StoreWepData = true;
	}

	if( Correct )
	{
// 		if( engine->GetPlayerMgr() && engine->GetPlayerMgr()->GetCurrentWeapon() )
// 			engine->GetPlayerMgr()->GetCurrentWeapon()->spreadMultiplier = 0.f;

		if( SetWepData )
		{
			cWeaponMgr* WepMgr = *(cWeaponMgr**)ADDR_WEAPONMGR;

			if( WepMgr )
			{
				for( int i = 0; i < WepMgr->WeaponCount; i++ )
				{ 
					cWeaponInfo* Wep = WepMgr->Weapons[i];

					if( Wep ) 
					{	
						Wep->fDuckPerturb = 0.0f;
						Wep->fMoveDuckPerturb = 0.0f;
						Wep->fPerturbIncSpeed = 0.0f;
						Wep->fPerturbDecSpeed = 0.0f;
						Wep->fCameraSwayXFreq = 0.0f;
						Wep->fCameraSwayYFreq = 0.0f;
						Wep->fZoomedPerturbIncSpeed = 0.0f;
						Wep->fZoomedPerturbDecSpeed = 0.0f; 
						Wep->fTripleShotMaxCamRecoilPitch = 0.0f;
						Wep->fTripleShotBaseCamRecoilPitch = 0.0f;
						Wep->fTripleShotPerturbIncSpeed = 0.0f;
						Wep->fTripleShotPerturbDecSpeed = 0.0f;
						Wep->fBaseCamRecoilPitch = 0.0f;
						Wep->fBaseCamRecoilAccelPitch = 0.0f;
						Wep->dwTripleShotMinPerturb = 0.0f;
						Wep->dwTripleShotMaxPerturb = 0.0f;
						Wep->dwMaxPerturb = 0.0f;
						Wep->dwMinPerturb = 0.0f;
						Wep->dwZoomedMaxPerturb = 0.0f;
						Wep->dwZoomedMinPerturb = 0.0f;
					} 
				}
			}
			SetWepData = false;
		}
	}
	else
	{	
		if( !SetWepData )
		{
			cWeaponMgr* WepMgr = *(cWeaponMgr**)ADDR_WEAPONMGR;

			if( WepMgr )
			{
				for( int i = 0; i < WepMgr->WeaponCount; i++ )
				{ 
					cWeaponInfo* Wep = WepMgr->Weapons[i];

					if( Wep ) 
					{	
						Wep->fDuckPerturb = OgAwepData[0][i];
						Wep->fMoveDuckPerturb = OgAwepData[1][i];
						Wep->fPerturbIncSpeed = OgAwepData[2][i];
						Wep->fPerturbDecSpeed = OgAwepData[3][i];
						Wep->fCameraSwayXFreq = OgAwepData[4][i];
						Wep->fCameraSwayYFreq = OgAwepData[5][i];
						Wep->fZoomedPerturbIncSpeed = OgAwepData[6][i];
						Wep->fZoomedPerturbDecSpeed = OgAwepData[7][i]; 
						Wep->fTripleShotMaxCamRecoilPitch = OgAwepData[8][i];
						Wep->fTripleShotBaseCamRecoilPitch = OgAwepData[9][i];
						Wep->fTripleShotPerturbIncSpeed = OgAwepData[10][i];
						Wep->fTripleShotPerturbDecSpeed = OgAwepData[11][i];
						Wep->fBaseCamRecoilPitch = OgAwepData[12][i];
						Wep->fBaseCamRecoilAccelPitch = OgAwepData[13][i];
						Wep->dwTripleShotMinPerturb = OgAwepData[14][i];
						Wep->dwTripleShotMaxPerturb = OgAwepData[15][i];
						Wep->dwMaxPerturb = OgAwepData[16][i];
						Wep->dwMinPerturb = OgAwepData[17][i];
						Wep->dwZoomedMaxPerturb = OgAwepData[18][i];
						Wep->dwZoomedMinPerturb = OgAwepData[19][i];
					} 
				}
			}
			SetWepData = true;
		}
	}
}
você enfiou a função na classe cHacks? se não tiver ela, ou nada do gênero, apenas remova..
AE VLW UM ERRO A MENOS AGORA FALTA ESSES


Code:
1>------ Build started: Project: CABASE, Configuration: Release Win32 ------
1>  Base.cpp
1>c:\users\matheus\desktop\uteis & hacks\bases sem dc\cabaseatt\Itens.h(262): error C2601: 'AimCorrection' : local function definitions are illegal
1>          c:\users\matheus\desktop\uteis & hacks\bases sem dc\cabaseatt\Itens.h(105): this line contains a '{' which has not yet been matched
1>c:\users\matheus\desktop\uteis & hacks\bases sem dc\cabaseatt\Itens.h(275): error C2109: subscript requires array or pointer type
1>c:\users\matheus\desktop\uteis & hacks\bases sem dc\cabaseatt\Itens.h(276): error C2109: subscript requires array or pointer type
1>c:\users\matheus\desktop\uteis & hacks\bases sem dc\cabaseatt\Itens.h(277): error C2109: subscript requires array or pointer type
1>c:\users\matheus\desktop\uteis & hacks\bases sem dc\cabaseatt\Itens.h(278): error C2109: subscript requires array or pointer type
1>c:\users\matheus\desktop\uteis & hacks\bases sem dc\cabaseatt\Itens.h(279): error C2109: subscript requires array or pointer type
1>c:\users\matheus\desktop\uteis & hacks\bases sem dc\cabaseatt\Itens.h(280): error C2109: subscript requires array or pointer type
1>c:\users\matheus\desktop\uteis & hacks\bases sem dc\cabaseatt\Itens.h(281): error C2109: subscript requires array or pointer type
1>c:\users\matheus\desktop\uteis & hacks\bases sem dc\cabaseatt\Itens.h(282): error C2109: subscript requires array or pointer type
1>c:\users\matheus\desktop\uteis & hacks\bases sem dc\cabaseatt\Itens.h(283): error C2109: subscript requires array or pointer type
1>c:\users\matheus\desktop\uteis & hacks\bases sem dc\cabaseatt\Itens.h(284): error C2109: subscript requires array or pointer type
1>c:\users\matheus\desktop\uteis & hacks\bases sem dc\cabaseatt\Itens.h(285): error C2109: subscript requires array or pointer type
1>c:\users\matheus\desktop\uteis & hacks\bases sem dc\cabaseatt\Itens.h(286): error C2109: subscript requires array or pointer type
1>c:\users\matheus\desktop\uteis & hacks\bases sem dc\cabaseatt\Itens.h(287): error C2109: subscript requires array or pointer type
1>c:\users\matheus\desktop\uteis & hacks\bases sem dc\cabaseatt\Itens.h(288): error C2109: subscript requires array or pointer type
1>c:\users\matheus\desktop\uteis & hacks\bases sem dc\cabaseatt\Itens.h(289): error C2109: subscript requires array or pointer type
1>c:\users\matheus\desktop\uteis & hacks\bases sem dc\cabaseatt\Itens.h(290): error C2109: subscript requires array or pointer type
1>c:\users\matheus\desktop\uteis & hacks\bases sem dc\cabaseatt\Itens.h(291): error C2109: subscript requires array or pointer type
1>c:\users\matheus\desktop\uteis & hacks\bases sem dc\cabaseatt\Itens.h(292): error C2109: subscript requires array or pointer type
1>c:\users\matheus\desktop\uteis & hacks\bases sem dc\cabaseatt\Itens.h(293): error C2109: subscript requires array or pointer type
1>c:\users\matheus\desktop\uteis & hacks\bases sem dc\cabaseatt\Itens.h(294): error C2109: subscript requires array or pointer type
1>c:\users\matheus\desktop\uteis & hacks\bases sem dc\cabaseatt\Itens.h(358): error C2109: subscript requires array or pointer type
1>c:\users\matheus\desktop\uteis & hacks\bases sem dc\cabaseatt\Itens.h(359): error C2109: subscript requires array or pointer type
1>c:\users\matheus\desktop\uteis & hacks\bases sem dc\cabaseatt\Itens.h(360): error C2109: subscript requires array or pointer type
1>c:\users\matheus\desktop\uteis & hacks\bases sem dc\cabaseatt\Itens.h(361): error C2109: subscript requires array or pointer type
1>c:\users\matheus\desktop\uteis & hacks\bases sem dc\cabaseatt\Itens.h(362): error C2109: subscript requires array or pointer type
1>c:\users\matheus\desktop\uteis & hacks\bases sem dc\cabaseatt\Itens.h(363): error C2109: subscript requires array or pointer type
1>c:\users\matheus\desktop\uteis & hacks\bases sem dc\cabaseatt\Itens.h(364): error C2109: subscript requires array or pointer type
1>c:\users\matheus\desktop\uteis & hacks\bases sem dc\cabaseatt\Itens.h(365): error C2109: subscript requires array or pointer type
1>c:\users\matheus\desktop\uteis & hacks\bases sem dc\cabaseatt\Itens.h(366): error C2109: subscript requires array or pointer type
1>c:\users\matheus\desktop\uteis & hacks\bases sem dc\cabaseatt\Itens.h(367): error C2109: subscript requires array or pointer type
1>c:\users\matheus\desktop\uteis & hacks\bases sem dc\cabaseatt\Itens.h(368): error C2109: subscript requires array or pointer type
1>c:\users\matheus\desktop\uteis & hacks\bases sem dc\cabaseatt\Itens.h(369): error C2109: subscript requires array or pointer type
1>c:\users\matheus\desktop\uteis & hacks\bases sem dc\cabaseatt\Itens.h(370): error C2109: subscript requires array or pointer type
1>c:\users\matheus\desktop\uteis & hacks\bases sem dc\cabaseatt\Itens.h(371): error C2109: subscript requires array or pointer type
1>c:\users\matheus\desktop\uteis & hacks\bases sem dc\cabaseatt\Itens.h(372): error C2109: subscript requires array or pointer type
1>c:\users\matheus\desktop\uteis & hacks\bases sem dc\cabaseatt\Itens.h(373): error C2109: subscript requires array or pointer type
1>c:\users\matheus\desktop\uteis & hacks\bases sem dc\cabaseatt\Itens.h(374): error C2109: subscript requires array or pointer type
1>c:\users\matheus\desktop\uteis & hacks\bases sem dc\cabaseatt\Itens.h(375): error C2109: subscript requires array or pointer type
1>c:\users\matheus\desktop\uteis & hacks\bases sem dc\cabaseatt\Itens.h(376): error C2109: subscript requires array or pointer type
1>c:\users\matheus\desktop\uteis & hacks\bases sem dc\cabaseatt\Itens.h(377): error C2109: subscript requires array or pointer type
========== Build: 0 succeeded, 1 failed, 0 up-to-date, 0 skipped ==========
Definiu em algum lugar errado, e tem uma chave sobrando }
se eu defini em um lugar errado,eu tirei ela de itens.h e coloquei em Aim Correction.h
Posts 1–6 of 6 · Page 1 of 1

Post a Reply

Similar Threads

Tags for this Thread

None

Need help?